Uploaded image for project: 'PUBLIC - Liferay Portal Community Edition'
  1. PUBLIC - Liferay Portal Community Edition
  2. LPS-138693

Element is not present at WYSIWYGUsecase#CanDisplayContentRightToLeft

    Details

    • Type: Testing
    • Status: Closed
    • Priority: Minor
    • Resolution: Discarded
    • Affects Version/s: Master
    • Fix Version/s: None
    • Component/s: CKEditor
    • Sprint:
      S04E22 - Ceremonials, S04E23 - Mamonas Assassinas, S04E24 - The Piano Guys
    • Testing Type:
      Analysis

      Description

      Testray
      Poshi
      Jenkins

           [exec]     BUILD FAILED: Element is not present at "//div[@class='wiki-body']/div/a"
           [exec]     /opt/dev/projects/github/liferay-portal/portal-web/test/functional/com/liferay/portalweb/macros/WikiPage.macro[addLocalizedFrontPagePG]:381
           [exec]     /opt/dev/projects/github/liferay-portal/portal-web/test/functional/com/liferay/portalweb/tests/enduser/frontendinfrastructure/uiinfrastructure/wysiwyg/usecase/WYSIWYGUsecase.testcase[CanDisplayContentRightToLeft]:196
           [exec] 
           [exec] 
           [exec] com.liferay.poshi.runner.PoshiRunner > test[LocalFile.WYSIWYGUsecase#CanDisplayContentRightToLeft] STANDARD_ERROR
           [exec]     com.liferay.poshi.runner.exception.ElementNotFoundPoshiRunnerException: Element is not present at "//div[@class='wiki-body']/div/a"
           [exec]     	at com.liferay.poshi.runner.selenium.BaseWebDriverImpl.getWebElement(BaseWebDriverImpl.java:4432)
           [exec]     	at com.liferay.poshi.runner.selenium.ChromeWebDriverImpl.getWebElement(ChromeWebDriverImpl.java:131)
           [exec]     	at com.liferay.poshi.runner.selenium.BaseWebDriverImpl.getText(BaseWebDriverImpl.java:1456)
           [exec]     	at com.liferay.poshi.runner.selenium.ChromeWebDriverImpl.getText(ChromeWebDriverImpl.java:100)
           [exec]     	at com.liferay.poshi.runner.selenium.BaseWebDriverImpl.getText(BaseWebDriverImpl.java:1448)
           [exec]     	at com.liferay.poshi.runner.selenium.BaseWebDriverImpl$20.evaluate(BaseWebDriverImpl.java:4272)
           [exec]     	at com.liferay.poshi.runner.selenium.BaseWebDriverImpl$20.assertTrue(BaseWebDriverImpl.java:4260)
           [exec]     	at com.liferay.poshi.runner.selenium.BaseWebDriverImpl$Condition.waitFor(BaseWebDriverImpl.java:4678)
           [exec]     	at com.liferay.poshi.runner.selenium.BaseWebDriverImpl$Condition.waitFor(BaseWebDriverImpl.java:4657)
           [exec]     	at com.liferay.poshi.runner.selenium.BaseWebDriverImpl.waitForTextCaseInsensitive(BaseWebDriverImpl.java:3560)
           [exec]     	at sun.reflect.NativeMethodAccessorImpl.invoke0(Native Method)
           [exec]     	at sun.reflect.NativeMethodAccessorImpl.invoke(NativeMethodAccessorImpl.java:62)
           [exec]     	at sun.reflect.DelegatingMethodAccessorImpl.invoke(DelegatingMethodAccessorImpl.java:43)
           [exec]     	at java.lang.reflect.Method.invoke(Method.java:498)
           [exec]     	at com.liferay.poshi.runner.PoshiRunnerExecutor$1.call(PoshiRunnerExecutor.java:1192)
           [exec]     	at java.util.concurrent.FutureTask.run(FutureTask.java:266)
           [exec]     	at java.util.concurrent.ThreadPoolExecutor.runWorker(ThreadPoolExecutor.java:1142)
           [exec]     	at java.util.concurrent.ThreadPoolExecutor$Worker.run(ThreadPoolExecutor.java:617)
           [exec]     	at java.lang.Thread.run(Thread.java:745)
           [exec] 
           [exec] com.liferay.poshi.runner.PoshiRunner > test[LocalFile.WYSIWYGUsecase#CanDisplayContentRightToLeft] STANDARD_OUT
           [exec]     Total duration of 'LiferaySelenium.pause' usages: 35000 ms
           [exec] 
           [exec] com.liferay.poshi.runner.PoshiRunner > test[LocalFile.WYSIWYGUsecase#CanDisplayContentRightToLeft] FAILED
           [exec]     com.liferay.poshi.runner.exception.ElementNotFoundPoshiRunnerException at BaseWebDriverImpl.java:4432
      

        Attachments

          Issue Links

            Activity

              People

              Assignee:
              support-qa Support QA
              Reporter:
              susan.chen Susan Chen
              Recent user:
              John Co
              Participants of an Issue:
              Votes:
              0 Vote for this issue
              Watchers:
              1 Start watching this issue

                Dates

                Created:
                Updated:
                Resolved:

                  Packages

                  Version Package