Uploaded image for project: 'PUBLIC - Liferay Portal Community Edition'
  1. PUBLIC - Liferay Portal Community Edition
  2. LPS-139358

com.liferay.microblogs.service relate test failed on 72FP backend testing

    Details

    • Type: Bug
    • Status: Verified
    • Resolution: Unresolved
    • Affects Version/s: 7.2.X
    • Fix Version/s: None
    • Component/s: Microblogs

      Description

      Affect case:
      com.liferay.microblogs.service.impl.test.MicroblogsEntryLocalServiceTest

      com.liferay.microblogs.service.impl.test.MicroblogsEntryLocalServiceTest > classMethod FAILED
           [exec]     org.osgi.framework.BundleException: Could not resolve module: com.liferay.microblogs.test [1185]
           [exec]       Unresolved requirement: Import-Package: com.liferay.microblogs.exception
           [exec]         at org.eclipse.osgi.container.Module.start(Module.java:444)
           [exec]         at org.eclipse.osgi.internal.framework.EquinoxBundle.start(EquinoxBundle.java:428)
           [exec]         at org.eclipse.osgi.internal.framework.EquinoxBundle.start(EquinoxBundle.java:447)
           [exec]         at com.liferay.arquillian.extension.junit.bridge.connector.FrameworkCommand.lambda$startBundle$37e16ea2$1(FrameworkCommand.java:46)
           [exec]         at com.liferay.arquillian.extension.junit.bridge.connector.ArquillianConnectorThread.run(ArquillianConnectorThread.java:82)
           [exec] 
      

      or

      exec] com.liferay.microblogs.service.impl.test.MicroblogsEntryLocalServiceTest > classMethod FAILED
           [exec]     java.lang.NullPointerException
           [exec]         at com.liferay.arquillian.extension.junit.bridge.client.SocketState.writeUTF(SocketState.java:123)
           [exec]         at com.liferay.arquillian.extension.junit.bridge.client.ClientState$1.execute(ClientState.java:127)
           [exec]         at com.liferay.arquillian.extension.junit.bridge.junit.Arquillian.run(Arquillian.java:122)
           [exec]         at org.gradle.api.internal.tasks.testing.junit.JUnitTestClassExecutor.runTestClass(JUnitTestClassExecutor.java:110)
           [exec]         at org.gradle.api.internal.tasks.testing.junit.JUnitTestClassExecutor.execute(JUnitTestClassExecutor.java:58)
           [exec]         at org.gradle.api.internal.tasks.testing.junit.JUnitTestClassExecutor.execute(JUnitTestClassExecutor.java:38)
           [exec]         at org.gradle.api.internal.tasks.testing.junit.AbstractJUnitTestClassProcessor.processTestClass(AbstractJUnitTestClassProcessor.java:62)
           [exec]         at org.gradle.api.internal.tasks.testing.SuiteTestClassProcessor.processTestClass(SuiteTestClassProcessor.java:51)
           [exec]         at sun.reflect.NativeMethodAccessorImpl.invoke0(Native Method)
           [exec]         at sun.reflect.NativeMethodAccessorImpl.invoke(NativeMethodAccessorImpl.java:62)
           [exec]         at sun.reflect.DelegatingMethodAccessorImpl.invoke(DelegatingMethodAccessorImpl.java:43)
           [exec]         at java.lang.reflect.Method.invoke(Method.java:498)
           [exec]         at org.gradle.internal.dispatch.ReflectionDispatch.dispatch(ReflectionDispatch.java:36)
           [exec]         at org.gradle.internal.dispatch.ReflectionDispatch.dispatch(ReflectionDispatch.java:24)
           [exec]         at org.gradle.internal.dispatch.ContextClassLoaderDispatch.dispatch(ContextClassLoaderDispatch.java:33)
           [exec]         at org.gradle.internal.dispatch.ProxyDispatchAdapter$DispatchingInvocationHandler.invoke(ProxyDispatchAdapter.java:94)
           [exec]         at com.sun.proxy.$Proxy2.processTestClass(Unknown Source)
           [exec]         at org.gradle.api.internal.tasks.testing.worker.TestWorker.processTestClass(TestWorker.java:119)
           [exec]         at sun.reflect.NativeMethodAccessorImpl.invoke0(Native Method)
           [exec]         at sun.reflect.NativeMethodAccessorImpl.invoke(NativeMethodAccessorImpl.java:62)
           [exec]         at sun.reflect.DelegatingMethodAccessorImpl.invoke(DelegatingMethodAccessorImpl.java:43)
           [exec]         at java.lang.reflect.Method.invoke(Method.java:498)
           [exec]         at org.gradle.internal.dispatch.ReflectionDispatch.dispatch(ReflectionDispatch.java:36)
           [exec]         at org.gradle.internal.dispatch.ReflectionDispatch.dispatch(ReflectionDispatch.java:24)
           [exec]         at org.gradle.internal.remote.internal.hub.MessageHubBackedObjectConnection$DispatchWrapper.dispatch(MessageHubBackedObjectConnection.java:182)
           [exec]         at org.gradle.internal.remote.internal.hub.MessageHubBackedObjectConnection$DispatchWrapper.dispatch(MessageHubBackedObjectConnection.java:164)
           [exec]         at org.gradle.internal.remote.internal.hub.MessageHub$Handler.run(MessageHub.java:414)
           [exec]         at org.gradle.internal.concurrent.ExecutorPolicy$CatchAndRecordFailures.onExecute(ExecutorPolicy.java:64)
           [exec]         at org.gradle.internal.concurrent.ManagedExecutorImpl$1.run(ManagedExecutorImpl.java:48)
           [exec]         at java.util.concurrent.ThreadPoolExecutor.runWorker(ThreadPoolExecutor.java:1142)
           [exec]         at java.util.concurrent.ThreadPoolExecutor$Worker.run(ThreadPoolExecutor.java:617)
           [exec]         at org.gradle.internal.concurrent.ThreadFactoryImpl$ManagedThreadRunnable.run(ThreadFactoryImpl.java:56)
           [exec]         at java.lang.Thread.run(Thread.java:745)
      

        Attachments

          Activity

            People

            Assignee:
            support-lep@liferay.com SE Support
            Reporter:
            raven.song Raven Song
            Participants of an Issue:
            Recent user:
            Raven Song
            Votes:
            0 Vote for this issue
            Watchers:
            0 Start watching this issue

              Dates

              Created:
              Updated:
              Days since last comment:
              11 weeks, 2 days ago

                Packages

                Version Package