Uploaded image for project: 'PUBLIC - Liferay Portal Community Edition'
  1. PUBLIC - Liferay Portal Community Edition
  2. LPS-158316

Modules Integration test failing at FileEntryInfoDisplayContributorTest

Details

    Description

      Testray
      Console link
      Console:

           [exec] com.liferay.document.library.info.display.contributor.test.FileEntryInfoDisplayContributorTest > testDisplayPageURLCustomLocaleAlgorithm1 STARTED
           [exec] 
           [exec] com.liferay.document.library.info.display.contributor.test.FileEntryInfoDisplayContributorTest > testDisplayPageURLCustomLocaleAlgorithm1 FAILED
           [exec]     org.junit.ComparisonFailure: expected:</fr/web/l3hlgyjh/d/[xgyzemtr]> but was:</fr/web/l3hlgyjh/d/[43819]>
           [exec]     	at org.junit.Assert.assertEquals(Assert.java:117)
           [exec]     	at org.junit.Assert.assertEquals(Assert.java:146)
           [exec]     	at com.liferay.document.library.info.display.contributor.test.FileEntryInfoDisplayContributorTest.lambda$testDisplayPageURLCustomLocaleAlgorithm1$0(FileEntryInfoDisplayContributorTest.java:109)
           [exec]     	at com.liferay.document.library.info.display.contributor.test.FileEntryInfoDisplayContributorTest._withAndWithoutAssetEntry(FileEntryInfoDisplayContributorTest.java:281)
           [exec]     	at com.liferay.document.library.info.display.contributor.test.FileEntryInfoDisplayContributorTest.testDisplayPageURLCustomLocaleAlgorithm1(FileEntryInfoDisplayContributorTest.java:89)
           [exec]     	at java.base/jdk.internal.reflect.NativeMethodAccessorImpl.invoke0(Native Method)
           [exec]     	at java.base/jdk.internal.reflect.NativeMethodAccessorImpl.invoke(NativeMethodAccessorImpl.java:62)
           [exec]     	at java.base/jdk.internal.reflect.DelegatingMethodAccessorImpl.invoke(DelegatingMethodAccessorImpl.java:43)
           [exec]     	at java.base/java.lang.reflect.Method.invoke(Method.java:566)
           [exec]     	at com.liferay.arquillian.extension.junit.bridge.server.TestExecutorRunnable$3.evaluate(TestExecutorRunnable.java:353)
           [exec]     	at org.junit.internal.runners.statements.RunBefores.evaluate(RunBefores.java:26)
           [exec]     	at com.liferay.portal.kernel.test.rule.AbstractTestRule$2.evaluate(AbstractTestRule.java:99)
           [exec]     	at com.liferay.portal.kernel.test.rule.AbstractTestRule$2.evaluate(AbstractTestRule.java:99)
           [exec]     	at com.liferay.portal.kernel.test.rule.AbstractTestRule$2.evaluate(AbstractTestRule.java:99)
           [exec]     	at com.liferay.portal.kernel.test.rule.AbstractTestRule$2.evaluate(AbstractTestRule.java:99)
           [exec]     	at com.liferay.portal.kernel.test.rule.AbstractTestRule$2.evaluate(AbstractTestRule.java:99)
           [exec]     	at com.liferay.portal.kernel.test.rule.AbstractTestRule$2.evaluate(AbstractTestRule.java:99)
           [exec]     	at com.liferay.portal.kernel.test.rule.AbstractTestRule$2.evaluate(AbstractTestRule.java:99)
           [exec]     	at org.junit.rules.RunRules.evaluate(RunRules.java:20)
           [exec]     	at com.liferay.arquillian.extension.junit.bridge.server.TestExecutorRunnable$1.evaluate(TestExecutorRunnable.java:237)
           [exec]     	at com.liferay.portal.kernel.test.rule.AbstractTestRule$1.evaluate(AbstractTestRule.java:59)
           [exec]     	at com.liferay.portal.kernel.test.rule.AbstractTestRule$1.evaluate(AbstractTestRule.java:59)
           [exec]     	at com.liferay.portal.kernel.test.rule.AbstractTestRule$1.evaluate(AbstractTestRule.java:59)
           [exec]     	at com.liferay.portal.kernel.test.rule.AbstractTestRule$1.evaluate(AbstractTestRule.java:59)
           [exec]     	at com.liferay.portal.kernel.test.rule.AbstractTestRule$1.evaluate(AbstractTestRule.java:59)
           [exec]     	at com.liferay.portal.kernel.test.rule.AbstractTestRule$1.evaluate(AbstractTestRule.java:59)
           [exec]     	at com.liferay.portal.kernel.test.rule.AbstractTestRule$1.evaluate(AbstractTestRule.java:59)
           [exec]     	at com.liferay.portal.kernel.test.rule.AbstractTestRule$1.evaluate(AbstractTestRule.java:59)
           [exec]     	at com.liferay.portal.kernel.test.rule.AbstractTestRule$1.evaluate(AbstractTestRule.java:59)
           [exec]     	at com.liferay.portal.kernel.test.rule.AbstractTestRule$1.evaluate(AbstractTestRule.java:59)
           [exec]     	at org.junit.rules.RunRules.evaluate(RunRules.java:20)
           [exec]     	at com.liferay.arquillian.extension.junit.bridge.server.TestExecutorRunnable._execute(TestExecutorRunnable.java:316)
           [exec]     	at com.liferay.arquillian.extension.junit.bridge.server.TestExecutorRunnable.run(TestExecutorRunnable.java:95)
           [exec]     	at java.base/java.lang.Thread.run(Thread.java:834)
           [exec] 
           [exec] com.liferay.document.library.info.display.contributor.test.FileEntryInfoDisplayContributorTest > testDisplayPageURLCustomLocaleAlgorithm1DefaultLocale STARTED
           [exec] 
           [exec] com.liferay.document.library.info.display.contributor.test.FileEntryInfoDisplayContributorTest > testDisplayPageURLCustomLocaleAlgorithm1DefaultLocale FAILED
           [exec]     org.junit.ComparisonFailure: expected:</web/fgvzcj0k/d/[vo1lehng]> but was:</web/fgvzcj0k/d/[43859]>
           [exec]     	at org.junit.Assert.assertEquals(Assert.java:117)
           [exec]     	at org.junit.Assert.assertEquals(Assert.java:146)
           [exec]     	at com.liferay.document.library.info.display.contributor.test.FileEntryInfoDisplayContributorTest.lambda$testDisplayPageURLCustomLocaleAlgorithm1DefaultLocale$1(FileEntryInfoDisplayContributorTest.java:149)
           [exec]     	at com.liferay.document.library.info.display.contributor.test.FileEntryInfoDisplayContributorTest._withAndWithoutAssetEntry(FileEntryInfoDisplayContributorTest.java:281)
           [exec]     	at com.liferay.document.library.info.display.contributor.test.FileEntryInfoDisplayContributorTest.testDisplayPageURLCustomLocaleAlgorithm1DefaultLocale(FileEntryInfoDisplayContributorTest.java:130)
           [exec]     	at java.base/jdk.internal.reflect.NativeMethodAccessorImpl.invoke0(Native Method)
           [exec]     	at java.base/jdk.internal.reflect.NativeMethodAccessorImpl.invoke(NativeMethodAccessorImpl.java:62)
           [exec]     	at java.base/jdk.internal.reflect.DelegatingMethodAccessorImpl.invoke(DelegatingMethodAccessorImpl.java:43)
           [exec]     	at java.base/java.lang.reflect.Method.invoke(Method.java:566)
           [exec]     	at com.liferay.arquillian.extension.junit.bridge.server.TestExecutorRunnable$3.evaluate(TestExecutorRunnable.java:353)
           [exec]     	at org.junit.internal.runners.statements.RunBefores.evaluate(RunBefores.java:26)
           [exec]     	at com.liferay.portal.kernel.test.rule.AbstractTestRule$2.evaluate(AbstractTestRule.java:99)
           [exec]     	at com.liferay.portal.kernel.test.rule.AbstractTestRule$2.evaluate(AbstractTestRule.java:99)
           [exec]     	at com.liferay.portal.kernel.test.rule.AbstractTestRule$2.evaluate(AbstractTestRule.java:99)
           [exec]     	at com.liferay.portal.kernel.test.rule.AbstractTestRule$2.evaluate(AbstractTestRule.java:99)
           [exec]     	at com.liferay.portal.kernel.test.rule.AbstractTestRule$2.evaluate(AbstractTestRule.java:99)
           [exec]     	at com.liferay.portal.kernel.test.rule.AbstractTestRule$2.evaluate(AbstractTestRule.java:99)
           [exec]     	at com.liferay.portal.kernel.test.rule.AbstractTestRule$2.evaluate(AbstractTestRule.java:99)
           [exec]     	at org.junit.rules.RunRules.evaluate(RunRules.java:20)
           [exec]     	at com.liferay.arquillian.extension.junit.bridge.server.TestExecutorRunnable$1.evaluate(TestExecutorRunnable.java:237)
           [exec]     	at com.liferay.portal.kernel.test.rule.AbstractTestRule$1.evaluate(AbstractTestRule.java:59)
           [exec]     	at com.liferay.portal.kernel.test.rule.AbstractTestRule$1.evaluate(AbstractTestRule.java:59)
           [exec]     	at com.liferay.portal.kernel.test.rule.AbstractTestRule$1.evaluate(AbstractTestRule.java:59)
           [exec]     	at com.liferay.portal.kernel.test.rule.AbstractTestRule$1.evaluate(AbstractTestRule.java:59)
           [exec]     	at com.liferay.portal.kernel.test.rule.AbstractTestRule$1.evaluate(AbstractTestRule.java:59)
           [exec]     	at com.liferay.portal.kernel.test.rule.AbstractTestRule$1.evaluate(AbstractTestRule.java:59)
           [exec]     	at com.liferay.portal.kernel.test.rule.AbstractTestRule$1.evaluate(AbstractTestRule.java:59)
           [exec]     	at com.liferay.portal.kernel.test.rule.AbstractTestRule$1.evaluate(AbstractTestRule.java:59)
           [exec]     	at com.liferay.portal.kernel.test.rule.AbstractTestRule$1.evaluate(AbstractTestRule.java:59)
           [exec]     	at com.liferay.portal.kernel.test.rule.AbstractTestRule$1.evaluate(AbstractTestRule.java:59)
           [exec]     	at org.junit.rules.RunRules.evaluate(RunRules.java:20)
           [exec]     	at com.liferay.arquillian.extension.junit.bridge.server.TestExecutorRunnable._execute(TestExecutorRunnable.java:316)
           [exec]     	at com.liferay.arquillian.extension.junit.bridge.server.TestExecutorRunnable.run(TestExecutorRunnable.java:95)
           [exec]     	at java.base/java.lang.Thread.run(Thread.java:834)
           [exec] 
           [exec] com.liferay.document.library.info.display.contributor.test.FileEntryInfoDisplayContributorTest > testDisplayPageURLCustomLocaleAlgorithm2 STARTED
           [exec] 
           [exec] com.liferay.document.library.info.display.contributor.test.FileEntryInfoDisplayContributorTest > testDisplayPageURLCustomLocaleAlgorithm2 FAILED
           [exec]     org.junit.ComparisonFailure: expected:</en/web/elmj57k2/d/[f4ckqgba]> but was:</en/web/elmj57k2/d/[43899]>
           [exec]     	at org.junit.Assert.assertEquals(Assert.java:117)
           [exec]     	at org.junit.Assert.assertEquals(Assert.java:146)
           [exec]     	at com.liferay.document.library.info.display.contributor.test.FileEntryInfoDisplayContributorTest.lambda$testDisplayPageURLCustomLocaleAlgorithm2$2(FileEntryInfoDisplayContributorTest.java:190)
           [exec]     	at com.liferay.document.library.info.display.contributor.test.FileEntryInfoDisplayContributorTest._withAndWithoutAssetEntry(FileEntryInfoDisplayContributorTest.java:281)
           [exec]     	at com.liferay.document.library.info.display.contributor.test.FileEntryInfoDisplayContributorTest.testDisplayPageURLCustomLocaleAlgorithm2(FileEntryInfoDisplayContributorTest.java:170)
           [exec]     	at java.base/jdk.internal.reflect.NativeMethodAccessorImpl.invoke0(Native Method)
           [exec]     	at java.base/jdk.internal.reflect.NativeMethodAccessorImpl.invoke(NativeMethodAccessorImpl.java:62)
           [exec]     	at java.base/jdk.internal.reflect.DelegatingMethodAccessorImpl.invoke(DelegatingMethodAccessorImpl.java:43)
           [exec]     	at java.base/java.lang.reflect.Method.invoke(Method.java:566)
           [exec]     	at com.liferay.arquillian.extension.junit.bridge.server.TestExecutorRunnable$3.evaluate(TestExecutorRunnable.java:353)
           [exec]     	at org.junit.internal.runners.statements.RunBefores.evaluate(RunBefores.java:26)
           [exec]     	at com.liferay.portal.kernel.test.rule.AbstractTestRule$2.evaluate(AbstractTestRule.java:99)
           [exec]     	at com.liferay.portal.kernel.test.rule.AbstractTestRule$2.evaluate(AbstractTestRule.java:99)
           [exec]     	at com.liferay.portal.kernel.test.rule.AbstractTestRule$2.evaluate(AbstractTestRule.java:99)
           [exec]     	at com.liferay.portal.kernel.test.rule.AbstractTestRule$2.evaluate(AbstractTestRule.java:99)
           [exec]     	at com.liferay.portal.kernel.test.rule.AbstractTestRule$2.evaluate(AbstractTestRule.java:99)
           [exec]     	at com.liferay.portal.kernel.test.rule.AbstractTestRule$2.evaluate(AbstractTestRule.java:99)
           [exec]     	at com.liferay.portal.kernel.test.rule.AbstractTestRule$2.evaluate(AbstractTestRule.java:99)
           [exec]     	at org.junit.rules.RunRules.evaluate(RunRules.java:20)
           [exec]     	at com.liferay.arquillian.extension.junit.bridge.server.TestExecutorRunnable$1.evaluate(TestExecutorRunnable.java:237)
           [exec]     	at com.liferay.portal.kernel.test.rule.AbstractTestRule$1.evaluate(AbstractTestRule.java:59)
           [exec]     	at com.liferay.portal.kernel.test.rule.AbstractTestRule$1.evaluate(AbstractTestRule.java:59)
           [exec]     	at com.liferay.portal.kernel.test.rule.AbstractTestRule$1.evaluate(AbstractTestRule.java:59)
           [exec]     	at com.liferay.portal.kernel.test.rule.AbstractTestRule$1.evaluate(AbstractTestRule.java:59)
           [exec]     	at com.liferay.portal.kernel.test.rule.AbstractTestRule$1.evaluate(AbstractTestRule.java:59)
           [exec]     	at com.liferay.portal.kernel.test.rule.AbstractTestRule$1.evaluate(AbstractTestRule.java:59)
           [exec]     	at com.liferay.portal.kernel.test.rule.AbstractTestRule$1.evaluate(AbstractTestRule.java:59)
           [exec]     	at com.liferay.portal.kernel.test.rule.AbstractTestRule$1.evaluate(AbstractTestRule.java:59)
           [exec]     	at com.liferay.portal.kernel.test.rule.AbstractTestRule$1.evaluate(AbstractTestRule.java:59)
           [exec]     	at com.liferay.portal.kernel.test.rule.AbstractTestRule$1.evaluate(AbstractTestRule.java:59)
           [exec]     	at org.junit.rules.RunRules.evaluate(RunRules.java:20)
           [exec]     	at com.liferay.arquillian.extension.junit.bridge.server.TestExecutorRunnable._execute(TestExecutorRunnable.java:316)
           [exec]     	at com.liferay.arquillian.extension.junit.bridge.server.TestExecutorRunnable.run(TestExecutorRunnable.java:95)
           [exec]     	at java.base/java.lang.Thread.run(Thread.java:834)
           [exec] 
           [exec] com.liferay.document.library.info.display.contributor.test.FileEntryInfoDisplayContributorTest > testDisplayPageURLCustomLocaleAlgorithmDefault STARTED
           [exec] 
           [exec] com.liferay.document.library.info.display.contributor.test.FileEntryInfoDisplayContributorTest > testDisplayPageURLCustomLocaleAlgorithmDefault FAILED
           [exec]     org.junit.ComparisonFailure: expected:</web/gacyvwvz/d/[xajet1yo]> but was:</web/gacyvwvz/d/[43939]>
           [exec]     	at org.junit.Assert.assertEquals(Assert.java:117)
           [exec]     	at org.junit.Assert.assertEquals(Assert.java:146)
           [exec]     	at com.liferay.document.library.info.display.contributor.test.FileEntryInfoDisplayContributorTest.lambda$testDisplayPageURLCustomLocaleAlgorithmDefault$3(FileEntryInfoDisplayContributorTest.java:230)
           [exec]     	at com.liferay.document.library.info.display.contributor.test.FileEntryInfoDisplayContributorTest._withAndWithoutAssetEntry(FileEntryInfoDisplayContributorTest.java:281)
           [exec]     	at com.liferay.document.library.info.display.contributor.test.FileEntryInfoDisplayContributorTest.testDisplayPageURLCustomLocaleAlgorithmDefault(FileEntryInfoDisplayContributorTest.java:211)
           [exec]     	at java.base/jdk.internal.reflect.NativeMethodAccessorImpl.invoke0(Native Method)
           [exec]     	at java.base/jdk.internal.reflect.NativeMethodAccessorImpl.invoke(NativeMethodAccessorImpl.java:62)
           [exec]     	at java.base/jdk.internal.reflect.DelegatingMethodAccessorImpl.invoke(DelegatingMethodAccessorImpl.java:43)
           [exec]     	at java.base/java.lang.reflect.Method.invoke(Method.java:566)
           [exec]     	at com.liferay.arquillian.extension.junit.bridge.server.TestExecutorRunnable$3.evaluate(TestExecutorRunnable.java:353)
           [exec]     	at org.junit.internal.runners.statements.RunBefores.evaluate(RunBefores.java:26)
           [exec]     	at com.liferay.portal.kernel.test.rule.AbstractTestRule$2.evaluate(AbstractTestRule.java:99)
           [exec]     	at com.liferay.portal.kernel.test.rule.AbstractTestRule$2.evaluate(AbstractTestRule.java:99)
           [exec]     	at com.liferay.portal.kernel.test.rule.AbstractTestRule$2.evaluate(AbstractTestRule.java:99)
           [exec]     	at com.liferay.portal.kernel.test.rule.AbstractTestRule$2.evaluate(AbstractTestRule.java:99)
           [exec]     	at com.liferay.portal.kernel.test.rule.AbstractTestRule$2.evaluate(AbstractTestRule.java:99)
           [exec]     	at com.liferay.portal.kernel.test.rule.AbstractTestRule$2.evaluate(AbstractTestRule.java:99)
           [exec]     	at com.liferay.portal.kernel.test.rule.AbstractTestRule$2.evaluate(AbstractTestRule.java:99)
           [exec]     	at org.junit.rules.RunRules.evaluate(RunRules.java:20)
           [exec]     	at com.liferay.arquillian.extension.junit.bridge.server.TestExecutorRunnable$1.evaluate(TestExecutorRunnable.java:237)
           [exec]     	at com.liferay.portal.kernel.test.rule.AbstractTestRule$1.evaluate(AbstractTestRule.java:59)
           [exec]     	at com.liferay.portal.kernel.test.rule.AbstractTestRule$1.evaluate(AbstractTestRule.java:59)
           [exec]     	at com.liferay.portal.kernel.test.rule.AbstractTestRule$1.evaluate(AbstractTestRule.java:59)
           [exec]     	at com.liferay.portal.kernel.test.rule.AbstractTestRule$1.evaluate(AbstractTestRule.java:59)
           [exec]     	at com.liferay.portal.kernel.test.rule.AbstractTestRule$1.evaluate(AbstractTestRule.java:59)
           [exec]     	at com.liferay.portal.kernel.test.rule.AbstractTestRule$1.evaluate(AbstractTestRule.java:59)
           [exec]     	at com.liferay.portal.kernel.test.rule.AbstractTestRule$1.evaluate(AbstractTestRule.java:59)
           [exec]     	at com.liferay.portal.kernel.test.rule.AbstractTestRule$1.evaluate(AbstractTestRule.java:59)
           [exec]     	at com.liferay.portal.kernel.test.rule.AbstractTestRule$1.evaluate(AbstractTestRule.java:59)
           [exec]     	at com.liferay.portal.kernel.test.rule.AbstractTestRule$1.evaluate(AbstractTestRule.java:59)
           [exec]     	at org.junit.rules.RunRules.evaluate(RunRules.java:20)
           [exec]     	at com.liferay.arquillian.extension.junit.bridge.server.TestExecutorRunnable._execute(TestExecutorRunnable.java:316)
           [exec]     	at com.liferay.arquillian.extension.junit.bridge.server.TestExecutorRunnable.run(TestExecutorRunnable.java:95)
           [exec]     	at java.base/java.lang.Thread.run(Thread.java:834)
      

      Attachments

        Activity

          People

            yvonne.han Yvonne Han
            yvonne.han Yvonne Han
            Marta Elicegui Marta Elicegui
            Adolfo Pérez Adolfo Pérez
            Votes:
            0 Vote for this issue
            Watchers:
            0 Start watching this issue

            Dates

              Created:
              Updated:
              Resolved:
              11 weeks, 2 days ago

              Packages

                Version Package
                7.4.3.35 CE GA35
                Master