Details

    • Type: Regression Bug
    • Status: Closed
    • Resolution: Fixed
    • Affects Version/s: 6.2.0 CE RC2
    • Fix Version/s: 6.2.0 CE RC1
    • Component/s: Dev Tools, Testing
    • Labels:
      None
    • Environment:
       Tomcat 7.0 + MySQL 5. Portal master GIT ID: abaa830c11ed3aff0ac4c017a0a01a06f0c1cd7c.
       Plugins master GIT ID: cb037cddea7d28efa63cb36e1cb586c163da4608.

      Description

      The following TCK Tests fail:

      1. com.sun.ts.tests.portlet.api.javax_portlet.EventRequest.SpecURLClient.GetParameterOnlySeenByTargetTest
      2. com.sun.ts.tests.portlet.api.javax_portlet.Portlet.SpecURLClient.ProcessActionFinishBeforeRenderTest
      3. com.sun.ts.tests.portlet.api.javax_portlet.RenderResponse.URLClient.SetInvalidContentTypeTest

      Here is a printout of the failures:

      Completed running 629 tests.
      Number of Tests Passed = 626
      Number of Tests Failed = 3
      ********************************************************************************
      PASSED........com.sun.ts.tests.portlet.api.javax_portlet.ActionRequest.SpecURLClient.CheckActionRequestParameterTest
      PASSED........com.sun.ts.tests.portlet.api.javax_portlet.ActionRequest.SpecURLClient.GetParameterOnlySeenByTargetTest
      PASSED........com.sun.ts.tests.portlet.api.javax_portlet.ActionRequest.SpecURLClient.CheckSingleParameterValuesTest
      PASSED........com.sun.ts.tests.portlet.api.javax_portlet.ActionRequest.SpecURLClient.GetContextPathSyntaxTest
      PASSED........com.sun.ts.tests.portlet.api.javax_portlet.ActionRequest.SpecURLClient.GetParameterMapEmptyTest
      PASSED........com.sun.ts.tests.portlet.api.javax_portlet.ActionRequest.SpecURLClient.GetLifecyclePhaseAttributeTest
      PASSED........com.sun.ts.tests.portlet.api.javax_portlet.ActionRequest.URLClient.GetAttributeNamesTest
      PASSED........com.sun.ts.tests.portlet.api.javax_portlet.ActionRequest.URLClient.GetAttributeTest
      PASSED........com.sun.ts.tests.portlet.api.javax_portlet.ActionRequest.URLClient.GetAttributeInvalidTest
      PASSED........com.sun.ts.tests.portlet.api.javax_portlet.ActionRequest.URLClient.GetAuthTypeWithoutProtectionTest
      PASSED........com.sun.ts.tests.portlet.api.javax_portlet.ActionRequest.URLClient.GetContextPathTest
      PASSED........com.sun.ts.tests.portlet.api.javax_portlet.ActionRequest.URLClient.GetLocaleTest
      PASSED........com.sun.ts.tests.portlet.api.javax_portlet.ActionRequest.URLClient.GetParameterNamesTest
      PASSED........com.sun.ts.tests.portlet.api.javax_portlet.ActionRequest.URLClient.GetParameterTest
      PASSED........com.sun.ts.tests.portlet.api.javax_portlet.ActionRequest.URLClient.GetParameterValuesTest
      PASSED........com.sun.ts.tests.portlet.api.javax_portlet.ActionRequest.URLClient.GetPortalContextTest
      PASSED........com.sun.ts.tests.portlet.api.javax_portlet.ActionRequest.URLClient.GetPortletModeTest
      PASSED........com.sun.ts.tests.portlet.api.javax_portlet.ActionRequest.URLClient.GetPortletSessionTest
      PASSED........com.sun.ts.tests.portlet.api.javax_portlet.ActionRequest.URLClient.GetPreferencesTest
      PASSED........com.sun.ts.tests.portlet.api.javax_portlet.ActionRequest.URLClient.GetPortletSessionParamTest
      PASSED........com.sun.ts.tests.portlet.api.javax_portlet.ActionRequest.URLClient.GetWindowStateTest
      PASSED........com.sun.ts.tests.portlet.api.javax_portlet.ActionRequest.URLClient.GetParameterMapTest
      PASSED........com.sun.ts.tests.portlet.api.javax_portlet.ActionRequest.URLClient.GetInvalidParameterTest
      PASSED........com.sun.ts.tests.portlet.api.javax_portlet.ActionRequest.URLClient.GetRemoteUserNullTest
      PASSED........com.sun.ts.tests.portlet.api.javax_portlet.ActionRequest.URLClient.GetResponseContentTypeTest
      PASSED........com.sun.ts.tests.portlet.api.javax_portlet.ActionRequest.URLClient.GetResponseContentTypesTest
      PASSED........com.sun.ts.tests.portlet.api.javax_portlet.ActionRequest.URLClient.CheckIsPortletModeAllowedTest
      PASSED........com.sun.ts.tests.portlet.api.javax_portlet.ActionRequest.URLClient.IsRequestedSessionIdValidForValidSessionTest
      PASSED........com.sun.ts.tests.portlet.api.javax_portlet.ActionRequest.URLClient.IsRequestedSessionIdValidForInvalidSessionTest
      PASSED........com.sun.ts.tests.portlet.api.javax_portlet.ActionRequest.URLClient.CheckIsWindowStateAllowedTest
      PASSED........com.sun.ts.tests.portlet.api.javax_portlet.ActionRequest.URLClient.RemoveAttributeTest
      PASSED........com.sun.ts.tests.portlet.api.javax_portlet.ActionRequest.URLClient.SetAttributeTest
      PASSED........com.sun.ts.tests.portlet.api.javax_portlet.ActionRequest.URLClient.SetAttributeNullTest
      PASSED........com.sun.ts.tests.portlet.api.javax_portlet.ActionRequest.URLClient.SetCharacterEncodingIllegalStateTest
      PASSED........com.sun.ts.tests.portlet.api.javax_portlet.ActionResponse.SpecURLClient.NoRenderParametersTest
      PASSED........com.sun.ts.tests.portlet.api.javax_portlet.ActionResponse.SpecURLClient.SetPortletModeAfterSendRedirectTest
      PASSED........com.sun.ts.tests.portlet.api.javax_portlet.ActionResponse.SpecURLClient.SetRenderParameterStringAfterSendRedirectTest
      PASSED........com.sun.ts.tests.portlet.api.javax_portlet.ActionResponse.SpecURLClient.SetRenderParameterStringArrayAfterSendRedirectTest
      PASSED........com.sun.ts.tests.portlet.api.javax_portlet.ActionResponse.SpecURLClient.SetRenderParametersAfterSendRedirectTest
      PASSED........com.sun.ts.tests.portlet.api.javax_portlet.ActionResponse.SpecURLClient.SetWindowStateAfterSendRedirectTest
      PASSED........com.sun.ts.tests.portlet.api.javax_portlet.ActionResponse.SpecURLClient.GetNamespaceSameValueTest
      PASSED........com.sun.ts.tests.portlet.api.javax_portlet.ActionResponse.URLClient.SendRedirectIllegalArgumentExceptionTest
      PASSED........com.sun.ts.tests.portlet.api.javax_portlet.ActionResponse.URLClient.SendRedirectIllegalStateExceptionTest
      PASSED........com.sun.ts.tests.portlet.api.javax_portlet.ActionResponse.URLClient.SendRedirectTest
      PASSED........com.sun.ts.tests.portlet.api.javax_portlet.ActionResponse.URLClient.SetPortletModeIllegalStateExceptionTest
      PASSED........com.sun.ts.tests.portlet.api.javax_portlet.ActionResponse.URLClient.SetPortletModeTest
      PASSED........com.sun.ts.tests.portlet.api.javax_portlet.ActionResponse.URLClient.SetRenderParameterStringArrayIllegalArgumentExceptionTest
      PASSED........com.sun.ts.tests.portlet.api.javax_portlet.ActionResponse.URLClient.SetRenderParameterStringArrayIllegalStateExceptionTest
      PASSED........com.sun.ts.tests.portlet.api.javax_portlet.ActionResponse.URLClient.SetRenderParameterStringArrayTest
      PASSED........com.sun.ts.tests.portlet.api.javax_portlet.ActionResponse.URLClient.SetRenderParameterStringIllegalArgumentExceptionTest
      PASSED........com.sun.ts.tests.portlet.api.javax_portlet.ActionResponse.URLClient.SetRenderParameterStringIllegalStateExceptionTest
      PASSED........com.sun.ts.tests.portlet.api.javax_portlet.ActionResponse.URLClient.SetRenderParameterStringTest
      PASSED........com.sun.ts.tests.portlet.api.javax_portlet.ActionResponse.URLClient.SetRenderParametersIllegalArgumentExceptionTest
      PASSED........com.sun.ts.tests.portlet.api.javax_portlet.ActionResponse.URLClient.SetRenderParametersIllegalStateExceptionTest
      PASSED........com.sun.ts.tests.portlet.api.javax_portlet.ActionResponse.URLClient.SetRenderParametersTest
      PASSED........com.sun.ts.tests.portlet.api.javax_portlet.ActionResponse.URLClient.SetUndeclaredPortletModeTest
      PASSED........com.sun.ts.tests.portlet.api.javax_portlet.ActionResponse.URLClient.SetUndeclaredWindowStateTest
      PASSED........com.sun.ts.tests.portlet.api.javax_portlet.ActionResponse.URLClient.SetWindowStateIllegalStateExceptionTest
      PASSED........com.sun.ts.tests.portlet.api.javax_portlet.EventRequest.SpecURLClient.GetParameterValuesTest
      PASSED........com.sun.ts.tests.portlet.api.javax_portlet.EventRequest.SpecURLClient.CheckSingleParameterValuesTest
      PASSED........com.sun.ts.tests.portlet.api.javax_portlet.EventRequest.SpecURLClient.CheckEventRequestParameterRenderTest
      PASSED........com.sun.ts.tests.portlet.api.javax_portlet.EventRequest.SpecURLClient.CheckEventRequestParameterEventTest
      PASSED........com.sun.ts.tests.portlet.api.javax_portlet.EventRequest.SpecURLClient.GetParameterMapTest
      PASSED........com.sun.ts.tests.portlet.api.javax_portlet.EventRequest.SpecURLClient.GetParameterMapEmptyTest
      FAILED........com.sun.ts.tests.portlet.api.javax_portlet.EventRequest.SpecURLClient.GetParameterOnlySeenByTargetTest
      PASSED........com.sun.ts.tests.portlet.api.javax_portlet.EventRequest.SpecURLClient.GetLifecyclePhaseAttributeTest
      PASSED........com.sun.ts.tests.portlet.api.javax_portlet.EventRequest.SpecURLClient.GetContextPathSyntaxTest
      PASSED........com.sun.ts.tests.portlet.api.javax_portlet.EventRequest.SpecURLClient.GetAuthTypeWithoutProtectionTest
      PASSED........com.sun.ts.tests.portlet.api.javax_portlet.EventRequest.SpecURLClient.GetResponseContentTypesTest
      PASSED........com.sun.ts.tests.portlet.api.javax_portlet.EventRequest.SpecURLClient.GetEventNameTest
      PASSED........com.sun.ts.tests.portlet.api.javax_portlet.EventRequest.SpecURLClient.CheckEventPayloadTypeTest
      PASSED........com.sun.ts.tests.portlet.api.javax_portlet.EventRequest.SpecURLClient.SetEventLocalPartUseXmlDefaultTest
      PASSED........com.sun.ts.tests.portlet.api.javax_portlet.EventRequest.SpecURLClient.CheckEventNameInDDTest
      PASSED........com.sun.ts.tests.portlet.api.javax_portlet.EventRequest.SpecURLClient.CheckProcessOneEventTest
      PASSED........com.sun.ts.tests.portlet.api.javax_portlet.EventRequest.SpecURLClient.CheckFinishedBeforRenderTest
      PASSED........com.sun.ts.tests.portlet.api.javax_portlet.EventRequest.SpecURLClient.CheckDestroyTest
      PASSED........com.sun.ts.tests.portlet.api.javax_portlet.EventResponse.SpecURLClient.SetRenderParametersTest
      PASSED........com.sun.ts.tests.portlet.api.javax_portlet.EventResponse.SpecURLClient.CheckSendEventTest
      PASSED........com.sun.ts.tests.portlet.api.javax_portlet.EventResponse.SpecURLClient.SetMultipleEventsProcessActionTest
      PASSED........com.sun.ts.tests.portlet.api.javax_portlet.EventResponse.SpecURLClient.SetEventLocalPartTest
      PASSED........com.sun.ts.tests.portlet.api.javax_portlet.EventResponse.SpecURLClient.CheckOpIgnoredTest
      PASSED........com.sun.ts.tests.portlet.api.javax_portlet.EventResponse.SpecURLClient.SetRenderParametersReplaceTest
      PASSED........com.sun.ts.tests.portlet.api.javax_portlet.EventResponse.SpecURLClient.GetNamespaceSameValueTest
      PASSED........com.sun.ts.tests.portlet.api.javax_portlet.EventResponse.SpecURLClient.SetUndeclaredPortletModeTest
      PASSED........com.sun.ts.tests.portlet.api.javax_portlet.EventResponse.SpecURLClient.SetUndeclaredWindowStateTest
      PASSED........com.sun.ts.tests.portlet.api.javax_portlet.GenericPortlet.URLClient.AnnotatedDoEditTest
      PASSED........com.sun.ts.tests.portlet.api.javax_portlet.GenericPortlet.URLClient.DoEditTest
      PASSED........com.sun.ts.tests.portlet.api.javax_portlet.GenericPortlet.URLClient.AnnotatedDoHelpTest
      PASSED........com.sun.ts.tests.portlet.api.javax_portlet.GenericPortlet.URLClient.DoHelpTest
      PASSED........com.sun.ts.tests.portlet.api.javax_portlet.GenericPortlet.URLClient.AnnotatedDoViewTest
      PASSED........com.sun.ts.tests.portlet.api.javax_portlet.GenericPortlet.URLClient.DoViewTest
      PASSED........com.sun.ts.tests.portlet.api.javax_portlet.GenericPortlet.URLClient.GenericPortletTest
      PASSED........com.sun.ts.tests.portlet.api.javax_portlet.GenericPortlet.URLClient.GetInitParameterIllegalArgumentExceptionTest
      PASSED........com.sun.ts.tests.portlet.api.javax_portlet.GenericPortlet.URLClient.GetInitParameterNamesTest
      PASSED........com.sun.ts.tests.portlet.api.javax_portlet.GenericPortlet.URLClient.GetInitParameterTest
      PASSED........com.sun.ts.tests.portlet.api.javax_portlet.GenericPortlet.URLClient.GetPortletConfigTest
      PASSED........com.sun.ts.tests.portlet.api.javax_portlet.GenericPortlet.URLClient.GetPortletContextTest
      PASSED........com.sun.ts.tests.portlet.api.javax_portlet.GenericPortlet.URLClient.GetPortletNameTest
      PASSED........com.sun.ts.tests.portlet.api.javax_portlet.GenericPortlet.URLClient.GetResourceBundleTest
      PASSED........com.sun.ts.tests.portlet.api.javax_portlet.GenericPortlet.URLClient.GetTitleTest
      PASSED........com.sun.ts.tests.portlet.api.javax_portlet.GenericPortlet.URLClient.InitPortletExceptionTest
      PASSED........com.sun.ts.tests.portlet.api.javax_portlet.GenericPortlet.URLClient.InitTest
      PASSED........com.sun.ts.tests.portlet.api.javax_portlet.GenericPortlet.URLClient.InitUnavailableExceptionTest
      PASSED........com.sun.ts.tests.portlet.api.javax_portlet.GenericPortlet.URLClient.InitWithConfigParamTest
      PASSED........com.sun.ts.tests.portlet.api.javax_portlet.GenericPortlet.URLClient.ProcessActionTest
      PASSED........com.sun.ts.tests.portlet.api.javax_portlet.GenericPortlet.URLClient.RenderTest
      PASSED........com.sun.ts.tests.portlet.api.javax_portlet.PortalContext.URLClient.GetPortalInfoTest
      PASSED........com.sun.ts.tests.portlet.api.javax_portlet.PortalContext.URLClient.GetSupportedPortletModesTest
      PASSED........com.sun.ts.tests.portlet.api.javax_portlet.PortalContext.URLClient.GetSupportedWindowStatesTest
      PASSED........com.sun.ts.tests.portlet.api.javax_portlet.Portlet.SpecURLClient.InitFailedDestroyNotCalledTest
      PASSED........com.sun.ts.tests.portlet.api.javax_portlet.Portlet.SpecURLClient.InitRuntimeExceptionTest
      PASSED........com.sun.ts.tests.portlet.api.javax_portlet.Portlet.SpecURLClient.OnePortletObjectPerJVMTest
      PASSED........com.sun.ts.tests.portlet.api.javax_portlet.Portlet.SpecURLClient.PermanentlyUnavailableTest
      FAILED........com.sun.ts.tests.portlet.api.javax_portlet.Portlet.SpecURLClient.ProcessActionFinishBeforeRenderTest
      PASSED........com.sun.ts.tests.portlet.api.javax_portlet.Portlet.SpecURLClient.RenderInvokedForAllPortletsTest
      PASSED........com.sun.ts.tests.portlet.api.javax_portlet.Portlet.URLClient.DestroyTest
      PASSED........com.sun.ts.tests.portlet.api.javax_portlet.Portlet.URLClient.InitPortletExceptionTest
      PASSED........com.sun.ts.tests.portlet.api.javax_portlet.Portlet.URLClient.InitTest
      PASSED........com.sun.ts.tests.portlet.api.javax_portlet.Portlet.URLClient.InitUnavailableExceptionTest
      PASSED........com.sun.ts.tests.portlet.api.javax_portlet.Portlet.URLClient.NoActionProcessActionTest
      PASSED........com.sun.ts.tests.portlet.api.javax_portlet.Portlet.URLClient.ProcessActionTest
      PASSED........com.sun.ts.tests.portlet.api.javax_portlet.Portlet.URLClient.AnnotatedProcessActionTest
      PASSED........com.sun.ts.tests.portlet.api.javax_portlet.Portlet.URLClient.ProcessActionUnavailableExceptionTest
      PASSED........com.sun.ts.tests.portlet.api.javax_portlet.Portlet.URLClient.ProcessEventUnavailableExceptionTest
      PASSED........com.sun.ts.tests.portlet.api.javax_portlet.Portlet.URLClient.RenderTest
      PASSED........com.sun.ts.tests.portlet.api.javax_portlet.Portlet.URLClient.ServeResourceTest
      PASSED........com.sun.ts.tests.portlet.api.javax_portlet.PortletConfig.SpecURLClient.GetResourceBundleInlineWithLocalesTest
      PASSED........com.sun.ts.tests.portlet.api.javax_portlet.PortletConfig.SpecURLClient.GetResourceBundleBothTest
      PASSED........com.sun.ts.tests.portlet.api.javax_portlet.PortletConfig.SpecURLClient.GetResourceBundleOnlyInlineTest
      PASSED........com.sun.ts.tests.portlet.api.javax_portlet.PortletConfig.SpecURLClient.GetDefaultNamespaceTest
      PASSED........com.sun.ts.tests.portlet.api.javax_portlet.PortletConfig.SpecURLClient.GetPublicRenderParameterNamesTest
      PASSED........com.sun.ts.tests.portlet.api.javax_portlet.PortletConfig.SpecURLClient.GetNoPublicRenderParameterNamesTest
      PASSED........com.sun.ts.tests.portlet.api.javax_portlet.PortletConfig.SpecURLClient.GetPublishingProcessingEventQNamesTest
      PASSED........com.sun.ts.tests.portlet.api.javax_portlet.PortletConfig.SpecURLClient.GetPublishingProcessingEventNamesTest
      PASSED........com.sun.ts.tests.portlet.api.javax_portlet.PortletConfig.SpecURLClient.GetNoPublishingProcessingEventQNamesTest
      PASSED........com.sun.ts.tests.portlet.api.javax_portlet.PortletConfig.SpecURLClient.GetSupportedLocalesTest
      PASSED........com.sun.ts.tests.portlet.api.javax_portlet.PortletConfig.SpecURLClient.GetNoSupportedLocalesTest
      PASSED........com.sun.ts.tests.portlet.api.javax_portlet.PortletConfig.URLClient.GetInitParameterIllegalArgumentExceptionTest
      PASSED........com.sun.ts.tests.portlet.api.javax_portlet.PortletConfig.URLClient.GetPortletNameTest
      PASSED........com.sun.ts.tests.portlet.api.javax_portlet.PortletConfig.URLClient.GetInitParameterNamesTest
      PASSED........com.sun.ts.tests.portlet.api.javax_portlet.PortletConfig.URLClient.GetInitParameterTest
      PASSED........com.sun.ts.tests.portlet.api.javax_portlet.PortletConfig.URLClient.GetInitParameterNullTest
      PASSED........com.sun.ts.tests.portlet.api.javax_portlet.PortletConfig.URLClient.GetPortletContextTest
      PASSED........com.sun.ts.tests.portlet.api.javax_portlet.PortletConfig.URLClient.GetResourceBundleOnlyLocaleTest
      PASSED........com.sun.ts.tests.portlet.api.javax_portlet.PortletConfig.URLClient.GetResourceBundleSameNameTest
      PASSED........com.sun.ts.tests.portlet.api.javax_portlet.PortletConfigSecond.SpecURLClient.GetDefaultXMLNamespaceTest
      PASSED........com.sun.ts.tests.portlet.api.javax_portlet.PortletContext.SpecURLClient.CompareInitParamsInPortletAndServletTest
      PASSED........com.sun.ts.tests.portlet.api.javax_portlet.PortletContext.SpecURLClient.CompareContextAttrInPortletAndServletTest
      PASSED........com.sun.ts.tests.portlet.api.javax_portlet.PortletContext.SpecURLClient.CompareContextAttrInServletAndPortletTest
      PASSED........com.sun.ts.tests.portlet.api.javax_portlet.PortletContext.SpecURLClient.GetContextAttrForTempDirTest
      PASSED........com.sun.ts.tests.portlet.api.javax_portlet.PortletContext.URLClient.GetMajorVersionTest
      PASSED........com.sun.ts.tests.portlet.api.javax_portlet.PortletContext.URLClient.GetRealPathTest
      PASSED........com.sun.ts.tests.portlet.api.javax_portlet.PortletContext.URLClient.GetResourceAsStreamTest
      PASSED........com.sun.ts.tests.portlet.api.javax_portlet.PortletContext.URLClient.GetResourceTest
      PASSED........com.sun.ts.tests.portlet.api.javax_portlet.PortletContext.URLClient.GetResourceNullTest
      PASSED........com.sun.ts.tests.portlet.api.javax_portlet.PortletContext.URLClient.GetResourceMalformedURLExceptionTest
      PASSED........com.sun.ts.tests.portlet.api.javax_portlet.PortletContext.URLClient.GetServerInfoTest
      PASSED........com.sun.ts.tests.portlet.api.javax_portlet.PortletContext.URLClient.GetAttributeIllegalArgumentExceptionTest
      PASSED........com.sun.ts.tests.portlet.api.javax_portlet.PortletContext.URLClient.GetAttributeTest
      PASSED........com.sun.ts.tests.portlet.api.javax_portlet.PortletContext.URLClient.GetAttributeNullTest
      PASSED........com.sun.ts.tests.portlet.api.javax_portlet.PortletContext.URLClient.GetInitParameterIllegalArgumentExceptionTest
      PASSED........com.sun.ts.tests.portlet.api.javax_portlet.PortletContext.URLClient.GetInitParameterNamesTest
      PASSED........com.sun.ts.tests.portlet.api.javax_portlet.PortletContext.URLClient.GetInitParameterTest
      PASSED........com.sun.ts.tests.portlet.api.javax_portlet.PortletContext.URLClient.GetInitParameterNullTest
      PASSED........com.sun.ts.tests.portlet.api.javax_portlet.PortletContext.URLClient.RemoveAttributeIllegalArgumentExceptionTest
      PASSED........com.sun.ts.tests.portlet.api.javax_portlet.PortletContext.URLClient.RemoveAttributeTest
      PASSED........com.sun.ts.tests.portlet.api.javax_portlet.PortletContext.URLClient.SetAttributeIllegalArgumentExceptionTest
      PASSED........com.sun.ts.tests.portlet.api.javax_portlet.PortletContext.URLClient.SetAttributeTest
      PASSED........com.sun.ts.tests.portlet.api.javax_portlet.PortletContext.URLClient.GetAttributeNamesTest
      PASSED........com.sun.ts.tests.portlet.api.javax_portlet.PortletContext.URLClient.GetMinorVersionTest
      PASSED........com.sun.ts.tests.portlet.api.javax_portlet.PortletContext.URLClient.GetMimeTypeTest
      PASSED........com.sun.ts.tests.portlet.api.javax_portlet.PortletContext.URLClient.GetRequestDispatcherTest
      PASSED........com.sun.ts.tests.portlet.api.javax_portlet.PortletContext.URLClient.GetRequestDispatcherNullTest
      PASSED........com.sun.ts.tests.portlet.api.javax_portlet.PortletContext.URLClient.GetNamedDispatcherTest
      PASSED........com.sun.ts.tests.portlet.api.javax_portlet.PortletContext.URLClient.GetResourcePathsTest
      PASSED........com.sun.ts.tests.portlet.api.javax_portlet.PortletContext.URLClient.GetPortletContextNameTest
      PASSED........com.sun.ts.tests.portlet.api.javax_portlet.PortletException.URLClient.PortletExceptionCtr1Test
      PASSED........com.sun.ts.tests.portlet.api.javax_portlet.PortletException.URLClient.PortletExceptionCtr2Test
      PASSED........com.sun.ts.tests.portlet.api.javax_portlet.PortletException.URLClient.PortletExceptionCtr3Test
      PASSED........com.sun.ts.tests.portlet.api.javax_portlet.PortletException.URLClient.PortletExceptionCtr4Test
      PASSED........com.sun.ts.tests.portlet.api.javax_portlet.PortletException.URLClient.PrintStackTraceTest
      PASSED........com.sun.ts.tests.portlet.api.javax_portlet.PortletException.URLClient.PrintStackTraceStreamTest
      PASSED........com.sun.ts.tests.portlet.api.javax_portlet.PortletException.URLClient.PrintStackTraceWriterTest
      PASSED........com.sun.ts.tests.portlet.api.javax_portlet.PortletFilter.SpecURLClient.InitFilterTest
      PASSED........com.sun.ts.tests.portlet.api.javax_portlet.PortletFilter.SpecURLClient.InterfaceFilterTest
      PASSED........com.sun.ts.tests.portlet.api.javax_portlet.PortletFilter.SpecURLClient.InterfaceFilterEventTest
      PASSED........com.sun.ts.tests.portlet.api.javax_portlet.PortletFilter.SpecURLClient.DestroyFilterTest
      PASSED........com.sun.ts.tests.portlet.api.javax_portlet.PortletFilter.SpecURLClient.WrapperTest
      PASSED........com.sun.ts.tests.portlet.api.javax_portlet.PortletFilter.SpecURLClient.OneFilterObjectPerJVMTest
      PASSED........com.sun.ts.tests.portlet.api.javax_portlet.PortletFilter.SpecURLClient.WildcardTest
      PASSED........com.sun.ts.tests.portlet.api.javax_portlet.PortletFilter.SpecURLClient.FilterNotRemoveTest
      PASSED........com.sun.ts.tests.portlet.api.javax_portlet.PortletMode.SpecURLClient.ViewSupportedByDefaultTest
      PASSED........com.sun.ts.tests.portlet.api.javax_portlet.PortletMode.SpecURLClient.CheckPortletModeNotTroublingParametersTest
      PASSED........com.sun.ts.tests.portlet.api.javax_portlet.PortletMode.URLClient.EqualsTest
      PASSED........com.sun.ts.tests.portlet.api.javax_portlet.PortletMode.URLClient.HashCodeTest
      PASSED........com.sun.ts.tests.portlet.api.javax_portlet.PortletMode.URLClient.ToStringTest
      PASSED........com.sun.ts.tests.portlet.api.javax_portlet.PortletMode.URLClient.CheckPortletModeEditTest
      PASSED........com.sun.ts.tests.portlet.api.javax_portlet.PortletMode.URLClient.CheckPortletModeViewTest
      PASSED........com.sun.ts.tests.portlet.api.javax_portlet.PortletMode.URLClient.CheckPortletModeHelpTest
      PASSED........com.sun.ts.tests.portlet.api.javax_portlet.PortletModeException.URLClient.PortletModeExceptionCtr1Test
      PASSED........com.sun.ts.tests.portlet.api.javax_portlet.PortletModeException.URLClient.PortletModeExceptionCtr2Test
      PASSED........com.sun.ts.tests.portlet.api.javax_portlet.PortletModeException.URLClient.PortletModeExceptionCtr3Test
      PASSED........com.sun.ts.tests.portlet.api.javax_portlet.PortletPreferences.SpecURLClient.SetValueWithoutStoreTest
      PASSED........com.sun.ts.tests.portlet.api.javax_portlet.PortletPreferences.SpecURLClient.SetValueThruProgramTest
      PASSED........com.sun.ts.tests.portlet.api.javax_portlet.PortletPreferences.SpecURLClient.CheckPreferenceAttributeNullTest
      PASSED........com.sun.ts.tests.portlet.api.javax_portlet.PortletPreferences.URLClient.GetValueTest
      PASSED........com.sun.ts.tests.portlet.api.javax_portlet.PortletPreferences.URLClient.GetValueDefaultTest
      PASSED........com.sun.ts.tests.portlet.api.javax_portlet.PortletPreferences.URLClient.GetValueIllegalArgumentExceptionTest
      PASSED........com.sun.ts.tests.portlet.api.javax_portlet.PortletPreferences.URLClient.GetValuesTest
      PASSED........com.sun.ts.tests.portlet.api.javax_portlet.PortletPreferences.URLClient.GetValuesDefaultTest
      PASSED........com.sun.ts.tests.portlet.api.javax_portlet.PortletPreferences.URLClient.GetValuesIllegalArgumentExceptionTest
      PASSED........com.sun.ts.tests.portlet.api.javax_portlet.PortletPreferences.URLClient.GetNamesTest
      PASSED........com.sun.ts.tests.portlet.api.javax_portlet.PortletPreferences.URLClient.GetNamesEmptyTest
      PASSED........com.sun.ts.tests.portlet.api.javax_portlet.PortletPreferences.URLClient.GetMapTest
      PASSED........com.sun.ts.tests.portlet.api.javax_portlet.PortletPreferences.URLClient.GetMapEmptyTest
      PASSED........com.sun.ts.tests.portlet.api.javax_portlet.PortletPreferences.URLClient.IsReadOnlyTest
      PASSED........com.sun.ts.tests.portlet.api.javax_portlet.PortletPreferences.URLClient.IsReadOnlyIllegalArgumentExceptionTest
      PASSED........com.sun.ts.tests.portlet.api.javax_portlet.PortletPreferences.URLClient.ResetIllegalArgumentExceptionTest
      PASSED........com.sun.ts.tests.portlet.api.javax_portlet.PortletPreferences.URLClient.ResetTest
      PASSED........com.sun.ts.tests.portlet.api.javax_portlet.PortletPreferences.URLClient.ResetReadOnlyExceptionTest
      PASSED........com.sun.ts.tests.portlet.api.javax_portlet.PortletPreferences.URLClient.SetValueTest
      PASSED........com.sun.ts.tests.portlet.api.javax_portlet.PortletPreferences.URLClient.SetValueIllegalArgumentExceptionTest
      PASSED........com.sun.ts.tests.portlet.api.javax_portlet.PortletPreferences.URLClient.SetValueReadOnlyExceptionTest
      PASSED........com.sun.ts.tests.portlet.api.javax_portlet.PortletPreferences.URLClient.SetValuesTest
      PASSED........com.sun.ts.tests.portlet.api.javax_portlet.PortletPreferences.URLClient.SetValuesIllegalArgumentExceptionTest
      PASSED........com.sun.ts.tests.portlet.api.javax_portlet.PortletPreferences.URLClient.SetValuesReadOnlyExceptionTest
      PASSED........com.sun.ts.tests.portlet.api.javax_portlet.PortletPreferences.URLClient.StoreTest
      PASSED........com.sun.ts.tests.portlet.api.javax_portlet.PortletPreferences.URLClient.StoreWithValidatorTest
      PASSED........com.sun.ts.tests.portlet.api.javax_portlet.PortletPreferences.URLClient.StoreWithValidatorExceptionTest
      PASSED........com.sun.ts.tests.portlet.api.javax_portlet.PortletPreferences.URLClient.StoreIllegalStateExceptionTest
      PASSED........com.sun.ts.tests.portlet.api.javax_portlet.PortletRequestDispatcher.SpecURLClient.AccessToPathActionIncludeTest
      PASSED........com.sun.ts.tests.portlet.api.javax_portlet.PortletRequestDispatcher.SpecURLClient.AccessToPathEventingIncludeTest
      PASSED........com.sun.ts.tests.portlet.api.javax_portlet.PortletRequestDispatcher.SpecURLClient.AccessToPathRenderIncludeTest
      PASSED........com.sun.ts.tests.portlet.api.javax_portlet.PortletRequestDispatcher.SpecURLClient.AccessToPathServeResourceIncludeTest
      PASSED........com.sun.ts.tests.portlet.api.javax_portlet.PortletRequestDispatcher.SpecURLClient.IncludeNonexistingServletTest
      PASSED........com.sun.ts.tests.portlet.api.javax_portlet.PortletRequestDispatcher.SpecURLClient.IncludedRequestAttributesActionTest
      PASSED........com.sun.ts.tests.portlet.api.javax_portlet.PortletRequestDispatcher.SpecURLClient.IncludedRequestAttributesEventingTest
      PASSED........com.sun.ts.tests.portlet.api.javax_portlet.PortletRequestDispatcher.SpecURLClient.IncludedRequestAttributesRenderTest
      PASSED........com.sun.ts.tests.portlet.api.javax_portlet.PortletRequestDispatcher.SpecURLClient.IncludedRequestAttributesServeResourceTest
      PASSED........com.sun.ts.tests.portlet.api.javax_portlet.PortletRequestDispatcher.SpecURLClient.QueryStringParametersActionIncludeTest
      PASSED........com.sun.ts.tests.portlet.api.javax_portlet.PortletRequestDispatcher.SpecURLClient.QueryStringParametersEventingIncludeTest
      PASSED........com.sun.ts.tests.portlet.api.javax_portlet.PortletRequestDispatcher.SpecURLClient.QueryStringParametersRenderIncludeTest
      PASSED........com.sun.ts.tests.portlet.api.javax_portlet.PortletRequestDispatcher.SpecURLClient.QueryStringParametersServeResourceIncludeTest
      PASSED........com.sun.ts.tests.portlet.api.javax_portlet.PortletRequestDispatcher.SpecURLClient.RequestMethodsAttributeMiscActionIncludeTest
      PASSED........com.sun.ts.tests.portlet.api.javax_portlet.PortletRequestDispatcher.SpecURLClient.RequestMethodsAttributeMiscEventingIncludeTest
      PASSED........com.sun.ts.tests.portlet.api.javax_portlet.PortletRequestDispatcher.SpecURLClient.RequestMethodsAttributeMiscRenderIncludeTest
      PASSED........com.sun.ts.tests.portlet.api.javax_portlet.PortletRequestDispatcher.SpecURLClient.RequestMethodsAttributeMiscServeResourceIncludeTest
      PASSED........com.sun.ts.tests.portlet.api.javax_portlet.PortletRequestDispatcher.SpecURLClient.RequestMethodsGetInputStreamActionIncludeTest
      PASSED........com.sun.ts.tests.portlet.api.javax_portlet.PortletRequestDispatcher.SpecURLClient.RequestMethodsGetInputStreamEventingIncludeTest
      PASSED........com.sun.ts.tests.portlet.api.javax_portlet.PortletRequestDispatcher.SpecURLClient.RequestMethodsGetInputStreamRenderIncludeTest
      PASSED........com.sun.ts.tests.portlet.api.javax_portlet.PortletRequestDispatcher.SpecURLClient.RequestMethodsGetInputStreamServeResourceIncludeTest
      PASSED........com.sun.ts.tests.portlet.api.javax_portlet.PortletRequestDispatcher.SpecURLClient.RequestMethodsGetReaderActionIncludeTest
      PASSED........com.sun.ts.tests.portlet.api.javax_portlet.PortletRequestDispatcher.SpecURLClient.RequestMethodsGetReaderEventingIncludeTest
      PASSED........com.sun.ts.tests.portlet.api.javax_portlet.PortletRequestDispatcher.SpecURLClient.RequestMethodsGetReaderRenderIncludeTest
      PASSED........com.sun.ts.tests.portlet.api.javax_portlet.PortletRequestDispatcher.SpecURLClient.RequestMethodsGetReaderServeResourceIncludeTest
      PASSED........com.sun.ts.tests.portlet.api.javax_portlet.PortletRequestDispatcher.SpecURLClient.RequestMethodsGetRequestDispatcherActionIncludeTest
      PASSED........com.sun.ts.tests.portlet.api.javax_portlet.PortletRequestDispatcher.SpecURLClient.RequestMethodsGetRequestDispatcherEventingIncludeTest
      PASSED........com.sun.ts.tests.portlet.api.javax_portlet.PortletRequestDispatcher.SpecURLClient.RequestMethodsGetRequestDispatcherRenderIncludeTest
      PASSED........com.sun.ts.tests.portlet.api.javax_portlet.PortletRequestDispatcher.SpecURLClient.RequestMethodsGetRequestDispatcherServeResourceIncludeTest
      PASSED........com.sun.ts.tests.portlet.api.javax_portlet.PortletRequestDispatcher.SpecURLClient.RequestMethodsLocaleMiscActionIncludeTest
      PASSED........com.sun.ts.tests.portlet.api.javax_portlet.PortletRequestDispatcher.SpecURLClient.RequestMethodsLocaleMiscEventingIncludeTest
      PASSED........com.sun.ts.tests.portlet.api.javax_portlet.PortletRequestDispatcher.SpecURLClient.RequestMethodsLocaleMiscRenderIncludeTest
      PASSED........com.sun.ts.tests.portlet.api.javax_portlet.PortletRequestDispatcher.SpecURLClient.RequestMethodsLocaleMiscServeResourceIncludeTest
      PASSED........com.sun.ts.tests.portlet.api.javax_portlet.PortletRequestDispatcher.SpecURLClient.RequestMethodsMiscMiscActionIncludeTest
      PASSED........com.sun.ts.tests.portlet.api.javax_portlet.PortletRequestDispatcher.SpecURLClient.RequestMethodsMiscMiscEventingIncludeTest
      PASSED........com.sun.ts.tests.portlet.api.javax_portlet.PortletRequestDispatcher.SpecURLClient.RequestMethodsMiscMiscRenderIncludeTest
      PASSED........com.sun.ts.tests.portlet.api.javax_portlet.PortletRequestDispatcher.SpecURLClient.RequestMethodsMiscMiscServeResourceIncludeTest
      PASSED........com.sun.ts.tests.portlet.api.javax_portlet.PortletRequestDispatcher.SpecURLClient.RequestMethodsParameterMiscActionIncludeTest
      PASSED........com.sun.ts.tests.portlet.api.javax_portlet.PortletRequestDispatcher.SpecURLClient.RequestMethodsParameterMiscEventingIncludeTest
      PASSED........com.sun.ts.tests.portlet.api.javax_portlet.PortletRequestDispatcher.SpecURLClient.RequestMethodsParameterMiscRenderIncludeTest
      PASSED........com.sun.ts.tests.portlet.api.javax_portlet.PortletRequestDispatcher.SpecURLClient.RequestMethodsParameterMiscServeResourceIncludeTest
      PASSED........com.sun.ts.tests.portlet.api.javax_portlet.PortletRequestDispatcher.SpecURLClient.RequestMethodsReturn0ActionIncludeTest
      PASSED........com.sun.ts.tests.portlet.api.javax_portlet.PortletRequestDispatcher.SpecURLClient.RequestMethodsReturn0EventingIncludeTest
      PASSED........com.sun.ts.tests.portlet.api.javax_portlet.PortletRequestDispatcher.SpecURLClient.RequestMethodsReturn0RenderIncludeTest
      PASSED........com.sun.ts.tests.portlet.api.javax_portlet.PortletRequestDispatcher.SpecURLClient.RequestMethodsReturn0ServeResourceIncludeTest
      PASSED........com.sun.ts.tests.portlet.api.javax_portlet.PortletRequestDispatcher.SpecURLClient.RequestMethodsReturnNullActionIncludeTest
      PASSED........com.sun.ts.tests.portlet.api.javax_portlet.PortletRequestDispatcher.SpecURLClient.RequestMethodsReturnNullEventingIncludeTest
      PASSED........com.sun.ts.tests.portlet.api.javax_portlet.PortletRequestDispatcher.SpecURLClient.RequestMethodsReturnNullRenderIncludeTest
      PASSED........com.sun.ts.tests.portlet.api.javax_portlet.PortletRequestDispatcher.SpecURLClient.RequestMethodsReturnNullServeResourceIncludeTest
      PASSED........com.sun.ts.tests.portlet.api.javax_portlet.PortletRequestDispatcher.SpecURLClient.RequestMethodsReturnPathInfoActionIncludeTest
      PASSED........com.sun.ts.tests.portlet.api.javax_portlet.PortletRequestDispatcher.SpecURLClient.RequestMethodsReturnPathInfoEventingIncludeTest
      PASSED........com.sun.ts.tests.portlet.api.javax_portlet.PortletRequestDispatcher.SpecURLClient.RequestMethodsReturnPathInfoRenderIncludeTest
      PASSED........com.sun.ts.tests.portlet.api.javax_portlet.PortletRequestDispatcher.SpecURLClient.RequestMethodsReturnPathInfoServeResourceIncludeTest
      PASSED........com.sun.ts.tests.portlet.api.javax_portlet.PortletRequestDispatcher.SpecURLClient.RequestMethodsSecondMiscMiscActionIncludeTest
      PASSED........com.sun.ts.tests.portlet.api.javax_portlet.PortletRequestDispatcher.SpecURLClient.RequestMethodsSecondMiscMiscEventingIncludeTest
      PASSED........com.sun.ts.tests.portlet.api.javax_portlet.PortletRequestDispatcher.SpecURLClient.RequestMethodsSecondMiscMiscRenderIncludeTest
      PASSED........com.sun.ts.tests.portlet.api.javax_portlet.PortletRequestDispatcher.SpecURLClient.RequestMethodsSecondMiscMiscServeResourceIncludeTest
      PASSED........com.sun.ts.tests.portlet.api.javax_portlet.PortletRequestDispatcher.SpecURLClient.RequestMethodsSessionMiscActionIncludeTest
      PASSED........com.sun.ts.tests.portlet.api.javax_portlet.PortletRequestDispatcher.SpecURLClient.RequestMethodsSessionMiscEventingIncludeTest
      PASSED........com.sun.ts.tests.portlet.api.javax_portlet.PortletRequestDispatcher.SpecURLClient.RequestMethodsSessionMiscRenderIncludeTest
      PASSED........com.sun.ts.tests.portlet.api.javax_portlet.PortletRequestDispatcher.SpecURLClient.RequestMethodsSessionMiscServeResourceIncludeTest
      PASSED........com.sun.ts.tests.portlet.api.javax_portlet.PortletRequestDispatcher.SpecURLClient.ResponseMethodsGetOutputStreamActionIncludeTest
      PASSED........com.sun.ts.tests.portlet.api.javax_portlet.PortletRequestDispatcher.SpecURLClient.ResponseMethodsGetOutputStreamEventingIncludeTest
      PASSED........com.sun.ts.tests.portlet.api.javax_portlet.PortletRequestDispatcher.SpecURLClient.ResponseMethodsGetOutputStreamRenderIncludeTest
      PASSED........com.sun.ts.tests.portlet.api.javax_portlet.PortletRequestDispatcher.SpecURLClient.ResponseMethodsGetOutputStreamServeResourceIncludeTest
      PASSED........com.sun.ts.tests.portlet.api.javax_portlet.PortletRequestDispatcher.SpecURLClient.ResponseMethodsGetWriterActionIncludeTest
      PASSED........com.sun.ts.tests.portlet.api.javax_portlet.PortletRequestDispatcher.SpecURLClient.ResponseMethodsGetWriterEventingIncludeTest
      PASSED........com.sun.ts.tests.portlet.api.javax_portlet.PortletRequestDispatcher.SpecURLClient.ResponseMethodsGetWriterRenderIncludeTest
      PASSED........com.sun.ts.tests.portlet.api.javax_portlet.PortletRequestDispatcher.SpecURLClient.ResponseMethodsGetWriterServeResourceIncludeTest
      PASSED........com.sun.ts.tests.portlet.api.javax_portlet.PortletRequestDispatcher.SpecURLClient.ResponseMethodsMiscMiscActionIncludeTest
      PASSED........com.sun.ts.tests.portlet.api.javax_portlet.PortletRequestDispatcher.SpecURLClient.ResponseMethodsMiscMiscEventingIncludeTest
      PASSED........com.sun.ts.tests.portlet.api.javax_portlet.PortletRequestDispatcher.SpecURLClient.ResponseMethodsMiscMiscRenderIncludeTest
      PASSED........com.sun.ts.tests.portlet.api.javax_portlet.PortletRequestDispatcher.SpecURLClient.ResponseMethodsMiscMiscServeResourceIncludeTest
      PASSED........com.sun.ts.tests.portlet.api.javax_portlet.PortletRequestDispatcher.SpecURLClient.ResponseMethodsReturnNullActionIncludeTest
      PASSED........com.sun.ts.tests.portlet.api.javax_portlet.PortletRequestDispatcher.SpecURLClient.ResponseMethodsReturnNullEventingIncludeTest
      PASSED........com.sun.ts.tests.portlet.api.javax_portlet.PortletRequestDispatcher.SpecURLClient.ResponseMethodsReturnNullRenderIncludeTest
      PASSED........com.sun.ts.tests.portlet.api.javax_portlet.PortletRequestDispatcher.SpecURLClient.ResponseMethodsReturnNullServeResourceIncludeTest
      PASSED........com.sun.ts.tests.portlet.api.javax_portlet.PortletRequestDispatcher.SpecURLClient.SameThreadActionIncludeTest
      PASSED........com.sun.ts.tests.portlet.api.javax_portlet.PortletRequestDispatcher.SpecURLClient.SameThreadEventingIncludeTest
      PASSED........com.sun.ts.tests.portlet.api.javax_portlet.PortletRequestDispatcher.SpecURLClient.SameThreadRenderIncludeTest
      PASSED........com.sun.ts.tests.portlet.api.javax_portlet.PortletRequestDispatcher.SpecURLClient.SameThreadServeResourceIncludeTest
      PASSED........com.sun.ts.tests.portlet.api.javax_portlet.PortletRequestDispatcher.SpecURLClient.AccessToPathActionForwardTest
      PASSED........com.sun.ts.tests.portlet.api.javax_portlet.PortletRequestDispatcher.SpecURLClient.AccessToPathEventingForwardTest
      PASSED........com.sun.ts.tests.portlet.api.javax_portlet.PortletRequestDispatcher.SpecURLClient.AccessToPathRenderForwardTest
      PASSED........com.sun.ts.tests.portlet.api.javax_portlet.PortletRequestDispatcher.SpecURLClient.AccessToPathServeResourceForwardTest
      PASSED........com.sun.ts.tests.portlet.api.javax_portlet.PortletRequestDispatcher.SpecURLClient.MultipleForwardsActionForwardTest
      PASSED........com.sun.ts.tests.portlet.api.javax_portlet.PortletRequestDispatcher.SpecURLClient.MultipleForwardsEventingForwardTest
      PASSED........com.sun.ts.tests.portlet.api.javax_portlet.PortletRequestDispatcher.SpecURLClient.MultipleForwardsRenderForwardTest
      PASSED........com.sun.ts.tests.portlet.api.javax_portlet.PortletRequestDispatcher.SpecURLClient.MultipleForwardsServeResourceForwardTest
      PASSED........com.sun.ts.tests.portlet.api.javax_portlet.PortletRequestDispatcher.SpecURLClient.PathNotSetActionForwardTest
      PASSED........com.sun.ts.tests.portlet.api.javax_portlet.PortletRequestDispatcher.SpecURLClient.PathNotSetEventingForwardTest
      PASSED........com.sun.ts.tests.portlet.api.javax_portlet.PortletRequestDispatcher.SpecURLClient.PathNotSetRenderForwardTest
      PASSED........com.sun.ts.tests.portlet.api.javax_portlet.PortletRequestDispatcher.SpecURLClient.PathNotSetServeResourceForwardTest
      PASSED........com.sun.ts.tests.portlet.api.javax_portlet.PortletRequestDispatcher.SpecURLClient.RequestMethodsAttributeMiscActionForwardTest
      PASSED........com.sun.ts.tests.portlet.api.javax_portlet.PortletRequestDispatcher.SpecURLClient.RequestMethodsAttributeMiscEventingForwardTest
      PASSED........com.sun.ts.tests.portlet.api.javax_portlet.PortletRequestDispatcher.SpecURLClient.RequestMethodsAttributeMiscRenderForwardTest
      PASSED........com.sun.ts.tests.portlet.api.javax_portlet.PortletRequestDispatcher.SpecURLClient.RequestMethodsAttributeMiscServeResourceForwardTest
      PASSED........com.sun.ts.tests.portlet.api.javax_portlet.PortletRequestDispatcher.SpecURLClient.RequestMethodsGetInputStreamActionForwardTest
      PASSED........com.sun.ts.tests.portlet.api.javax_portlet.PortletRequestDispatcher.SpecURLClient.RequestMethodsGetInputStreamEventingForwardTest
      PASSED........com.sun.ts.tests.portlet.api.javax_portlet.PortletRequestDispatcher.SpecURLClient.RequestMethodsGetInputStreamRenderForwardTest
      PASSED........com.sun.ts.tests.portlet.api.javax_portlet.PortletRequestDispatcher.SpecURLClient.RequestMethodsGetInputStreamServeResourceForwardTest
      PASSED........com.sun.ts.tests.portlet.api.javax_portlet.PortletRequestDispatcher.SpecURLClient.RequestMethodsGetReaderActionForwardTest
      PASSED........com.sun.ts.tests.portlet.api.javax_portlet.PortletRequestDispatcher.SpecURLClient.RequestMethodsGetReaderEventingForwardTest
      PASSED........com.sun.ts.tests.portlet.api.javax_portlet.PortletRequestDispatcher.SpecURLClient.RequestMethodsGetReaderRenderForwardTest
      PASSED........com.sun.ts.tests.portlet.api.javax_portlet.PortletRequestDispatcher.SpecURLClient.RequestMethodsGetReaderServeResourceForwardTest
      PASSED........com.sun.ts.tests.portlet.api.javax_portlet.PortletRequestDispatcher.SpecURLClient.RequestMethodsGetRequestDispatcherActionForwardTest
      PASSED........com.sun.ts.tests.portlet.api.javax_portlet.PortletRequestDispatcher.SpecURLClient.RequestMethodsGetRequestDispatcherEventingForwardTest
      PASSED........com.sun.ts.tests.portlet.api.javax_portlet.PortletRequestDispatcher.SpecURLClient.RequestMethodsGetRequestDispatcherRenderForwardTest
      PASSED........com.sun.ts.tests.portlet.api.javax_portlet.PortletRequestDispatcher.SpecURLClient.RequestMethodsGetRequestDispatcherServeResourceForwardTest
      PASSED........com.sun.ts.tests.portlet.api.javax_portlet.PortletRequestDispatcher.SpecURLClient.RequestMethodsLocaleMiscActionForwardTest
      PASSED........com.sun.ts.tests.portlet.api.javax_portlet.PortletRequestDispatcher.SpecURLClient.RequestMethodsLocaleMiscEventingForwardTest
      PASSED........com.sun.ts.tests.portlet.api.javax_portlet.PortletRequestDispatcher.SpecURLClient.RequestMethodsLocaleMiscRenderForwardTest
      PASSED........com.sun.ts.tests.portlet.api.javax_portlet.PortletRequestDispatcher.SpecURLClient.RequestMethodsLocaleMiscServeResourceForwardTest
      PASSED........com.sun.ts.tests.portlet.api.javax_portlet.PortletRequestDispatcher.SpecURLClient.RequestMethodsMiscMiscActionForwardTest
      PASSED........com.sun.ts.tests.portlet.api.javax_portlet.PortletRequestDispatcher.SpecURLClient.RequestMethodsMiscMiscEventingForwardTest
      PASSED........com.sun.ts.tests.portlet.api.javax_portlet.PortletRequestDispatcher.SpecURLClient.RequestMethodsMiscMiscRenderForwardTest
      PASSED........com.sun.ts.tests.portlet.api.javax_portlet.PortletRequestDispatcher.SpecURLClient.RequestMethodsMiscMiscServeResourceForwardTest
      PASSED........com.sun.ts.tests.portlet.api.javax_portlet.PortletRequestDispatcher.SpecURLClient.RequestMethodsParameterMiscActionForwardTest
      PASSED........com.sun.ts.tests.portlet.api.javax_portlet.PortletRequestDispatcher.SpecURLClient.RequestMethodsParameterMiscEventingForwardTest
      PASSED........com.sun.ts.tests.portlet.api.javax_portlet.PortletRequestDispatcher.SpecURLClient.RequestMethodsParameterMiscRenderForwardTest
      PASSED........com.sun.ts.tests.portlet.api.javax_portlet.PortletRequestDispatcher.SpecURLClient.RequestMethodsParameterMiscServeResourceForwardTest
      PASSED........com.sun.ts.tests.portlet.api.javax_portlet.PortletRequestDispatcher.SpecURLClient.RequestMethodsReturn0ActionForwardTest
      PASSED........com.sun.ts.tests.portlet.api.javax_portlet.PortletRequestDispatcher.SpecURLClient.RequestMethodsReturn0EventingForwardTest
      PASSED........com.sun.ts.tests.portlet.api.javax_portlet.PortletRequestDispatcher.SpecURLClient.RequestMethodsReturn0RenderForwardTest
      PASSED........com.sun.ts.tests.portlet.api.javax_portlet.PortletRequestDispatcher.SpecURLClient.RequestMethodsReturn0ServeResourceForwardTest
      PASSED........com.sun.ts.tests.portlet.api.javax_portlet.PortletRequestDispatcher.SpecURLClient.RequestMethodsReturnNullActionForwardTest
      PASSED........com.sun.ts.tests.portlet.api.javax_portlet.PortletRequestDispatcher.SpecURLClient.RequestMethodsReturnNullEventingForwardTest
      PASSED........com.sun.ts.tests.portlet.api.javax_portlet.PortletRequestDispatcher.SpecURLClient.RequestMethodsReturnNullRenderForwardTest
      PASSED........com.sun.ts.tests.portlet.api.javax_portlet.PortletRequestDispatcher.SpecURLClient.RequestMethodsReturnNullServeResourceForwardTest
      PASSED........com.sun.ts.tests.portlet.api.javax_portlet.PortletRequestDispatcher.SpecURLClient.RequestMethodsReturnPathInfoActionForwardTest
      PASSED........com.sun.ts.tests.portlet.api.javax_portlet.PortletRequestDispatcher.SpecURLClient.RequestMethodsReturnPathInfoEventingForwardTest
      PASSED........com.sun.ts.tests.portlet.api.javax_portlet.PortletRequestDispatcher.SpecURLClient.RequestMethodsReturnPathInfoRenderForwardTest
      PASSED........com.sun.ts.tests.portlet.api.javax_portlet.PortletRequestDispatcher.SpecURLClient.RequestMethodsReturnPathInfoServeResourceForwardTest
      PASSED........com.sun.ts.tests.portlet.api.javax_portlet.PortletRequestDispatcher.SpecURLClient.RequestMethodsSecondMiscMiscActionForwardTest
      PASSED........com.sun.ts.tests.portlet.api.javax_portlet.PortletRequestDispatcher.SpecURLClient.RequestMethodsSecondMiscMiscEventingForwardTest
      PASSED........com.sun.ts.tests.portlet.api.javax_portlet.PortletRequestDispatcher.SpecURLClient.RequestMethodsSecondMiscMiscRenderForwardTest
      PASSED........com.sun.ts.tests.portlet.api.javax_portlet.PortletRequestDispatcher.SpecURLClient.RequestMethodsSecondMiscMiscServeResourceForwardTest
      PASSED........com.sun.ts.tests.portlet.api.javax_portlet.PortletRequestDispatcher.SpecURLClient.RequestMethodsSessionMiscActionForwardTest
      PASSED........com.sun.ts.tests.portlet.api.javax_portlet.PortletRequestDispatcher.SpecURLClient.RequestMethodsSessionMiscEventingForwardTest
      PASSED........com.sun.ts.tests.portlet.api.javax_portlet.PortletRequestDispatcher.SpecURLClient.RequestMethodsSessionMiscRenderForwardTest
      PASSED........com.sun.ts.tests.portlet.api.javax_portlet.PortletRequestDispatcher.SpecURLClient.RequestMethodsSessionMiscServeResourceForwardTest
      PASSED........com.sun.ts.tests.portlet.api.javax_portlet.PortletRequestDispatcher.SpecURLClient.ResponseBufferClearedRenderForwardTest
      PASSED........com.sun.ts.tests.portlet.api.javax_portlet.PortletRequestDispatcher.SpecURLClient.ResponseBufferClearedServeResourceForwardTest
      PASSED........com.sun.ts.tests.portlet.api.javax_portlet.PortletRequestDispatcher.SpecURLClient.ResponseBufferPortletCommitForwardTest
      PASSED........com.sun.ts.tests.portlet.api.javax_portlet.PortletRequestDispatcher.SpecURLClient.ResponseBufferCommittedRenderForwardTest
      PASSED........com.sun.ts.tests.portlet.api.javax_portlet.PortletRequestDispatcher.SpecURLClient.ResponseBufferCommittedServeResourceForwardTest
      PASSED........com.sun.ts.tests.portlet.api.javax_portlet.PortletRequestDispatcher.SpecURLClient.ResponseMethodsGetOutputStreamActionForwardTest
      PASSED........com.sun.ts.tests.portlet.api.javax_portlet.PortletRequestDispatcher.SpecURLClient.ResponseMethodsGetOutputStreamEventingForwardTest
      PASSED........com.sun.ts.tests.portlet.api.javax_portlet.PortletRequestDispatcher.SpecURLClient.ResponseMethodsGetOutputStreamRenderForwardTest
      PASSED........com.sun.ts.tests.portlet.api.javax_portlet.PortletRequestDispatcher.SpecURLClient.ResponseMethodsGetOutputStreamServeResourceForwardTest
      PASSED........com.sun.ts.tests.portlet.api.javax_portlet.PortletRequestDispatcher.SpecURLClient.ResponseMethodsGetWriterActionForwardTest
      PASSED........com.sun.ts.tests.portlet.api.javax_portlet.PortletRequestDispatcher.SpecURLClient.ResponseMethodsGetWriterEventingForwardTest
      PASSED........com.sun.ts.tests.portlet.api.javax_portlet.PortletRequestDispatcher.SpecURLClient.ResponseMethodsGetWriterRenderForwardTest
      PASSED........com.sun.ts.tests.portlet.api.javax_portlet.PortletRequestDispatcher.SpecURLClient.ResponseMethodsGetWriterServeResourceForwardTest
      PASSED........com.sun.ts.tests.portlet.api.javax_portlet.PortletRequestDispatcher.SpecURLClient.ResponseMethodsMiscMiscActionForwardTest
      PASSED........com.sun.ts.tests.portlet.api.javax_portlet.PortletRequestDispatcher.SpecURLClient.ResponseMethodsMiscMiscEventingForwardTest
      PASSED........com.sun.ts.tests.portlet.api.javax_portlet.PortletRequestDispatcher.SpecURLClient.ResponseMethodsMiscMiscRenderForwardTest
      PASSED........com.sun.ts.tests.portlet.api.javax_portlet.PortletRequestDispatcher.SpecURLClient.ResponseMethodsMiscMiscServeResourceForwardTest
      PASSED........com.sun.ts.tests.portlet.api.javax_portlet.PortletRequestDispatcher.SpecURLClient.ResponseMethodsReturnNullActionForwardTest
      PASSED........com.sun.ts.tests.portlet.api.javax_portlet.PortletRequestDispatcher.SpecURLClient.ResponseMethodsReturnNullEventingForwardTest
      PASSED........com.sun.ts.tests.portlet.api.javax_portlet.PortletRequestDispatcher.SpecURLClient.ResponseMethodsReturnNullRenderForwardTest
      PASSED........com.sun.ts.tests.portlet.api.javax_portlet.PortletRequestDispatcher.SpecURLClient.ResponseMethodsReturnNullServeResourceForwardTest
      PASSED........com.sun.ts.tests.portlet.api.javax_portlet.PortletRequestDispatcher.URLClient.IncludeHTMLTest
      PASSED........com.sun.ts.tests.portlet.api.javax_portlet.PortletRequestDispatcher.URLClient.IncludeIOExceptionTest
      PASSED........com.sun.ts.tests.portlet.api.javax_portlet.PortletRequestDispatcher.URLClient.IncludeJSPTest
      PASSED........com.sun.ts.tests.portlet.api.javax_portlet.PortletRequestDispatcher.URLClient.IncludePortletExceptionTest
      PASSED........com.sun.ts.tests.portlet.api.javax_portlet.PortletRequestDispatcher.URLClient.IncludeServletTest
      PASSED........com.sun.ts.tests.portlet.api.javax_portlet.PortletRequestDispatcher.URLClient.ServletCannotChangeStatusCodeTest
      PASSED........com.sun.ts.tests.portlet.api.javax_portlet.PortletSecurityException.URLClient.PortletSecurityExceptionCtr1Test
      PASSED........com.sun.ts.tests.portlet.api.javax_portlet.PortletSecurityException.URLClient.PortletSecurityExceptionCtr2Test
      PASSED........com.sun.ts.tests.portlet.api.javax_portlet.PortletSecurityException.URLClient.PortletSecurityExceptionCtr3Test
      PASSED........com.sun.ts.tests.portlet.api.javax_portlet.PortletSession.SpecURLClient.CheckSessionValueForPortletsInSameAppTest
      PASSED........com.sun.ts.tests.portlet.api.javax_portlet.PortletSession.SpecURLClient.CompareHttpAndPortletSessionTest
      PASSED........com.sun.ts.tests.portlet.api.javax_portlet.PortletSession.SpecURLClient.InvalidateServletAndPortletSessionTest
      PASSED........com.sun.ts.tests.portlet.api.javax_portlet.PortletSession.SpecURLClient.InvalidatePortletAndServletSessionTest
      PASSED........com.sun.ts.tests.portlet.api.javax_portlet.PortletSession.URLClient.GetAttributeIllegalArgumentExceptionTest
      PASSED........com.sun.ts.tests.portlet.api.javax_portlet.PortletSession.URLClient.GetAttributeNamesTest
      PASSED........com.sun.ts.tests.portlet.api.javax_portlet.PortletSession.URLClient.GetAttributeNamesIllegalStateTest
      PASSED........com.sun.ts.tests.portlet.api.javax_portlet.PortletSession.URLClient.GetAttributeTest
      PASSED........com.sun.ts.tests.portlet.api.javax_portlet.PortletSession.URLClient.GetAttributeNullTest
      PASSED........com.sun.ts.tests.portlet.api.javax_portlet.PortletSession.URLClient.GetAttributeIllegalStateTest
      PASSED........com.sun.ts.tests.portlet.api.javax_portlet.PortletSession.URLClient.GetCreationTimeTest
      PASSED........com.sun.ts.tests.portlet.api.javax_portlet.PortletSession.URLClient.GetCreationTimeIllegalStateTest
      PASSED........com.sun.ts.tests.portlet.api.javax_portlet.PortletSession.URLClient.GetIdTest
      PASSED........com.sun.ts.tests.portlet.api.javax_portlet.PortletSession.URLClient.GetLastAccessedTimeTest
      PASSED........com.sun.ts.tests.portlet.api.javax_portlet.PortletSession.URLClient.GetMaxInactiveIntervalTest
      PASSED........com.sun.ts.tests.portlet.api.javax_portlet.PortletSession.URLClient.GetPortletContextTest
      PASSED........com.sun.ts.tests.portlet.api.javax_portlet.PortletSession.URLClient.InvalidateTest
      PASSED........com.sun.ts.tests.portlet.api.javax_portlet.PortletSession.URLClient.InvalidateIllegalStateTest
      PASSED........com.sun.ts.tests.portlet.api.javax_portlet.PortletSession.URLClient.IsNewIllegalStateTest
      PASSED........com.sun.ts.tests.portlet.api.javax_portlet.PortletSession.URLClient.RemoveAttributeIllegalArgumentExceptionTest
      PASSED........com.sun.ts.tests.portlet.api.javax_portlet.PortletSession.URLClient.RemoveAttributeTest
      PASSED........com.sun.ts.tests.portlet.api.javax_portlet.PortletSession.URLClient.RemoveAttributeIllegalStateTest
      PASSED........com.sun.ts.tests.portlet.api.javax_portlet.PortletSession.URLClient.SetAttributeIllegalArgumentExceptionTest
      PASSED........com.sun.ts.tests.portlet.api.javax_portlet.PortletSession.URLClient.SetAttributeTest
      PASSED........com.sun.ts.tests.portlet.api.javax_portlet.PortletSession.URLClient.SetAttributeIllegalStateTest
      PASSED........com.sun.ts.tests.portlet.api.javax_portlet.PortletSession.URLClient.SetMaxInactiveIntervalTest
      PASSED........com.sun.ts.tests.portlet.api.javax_portlet.PortletSessionAppscope.URLClient.GetAttributeNamesTest
      PASSED........com.sun.ts.tests.portlet.api.javax_portlet.PortletSessionAppscope.URLClient.GetAttributeNamesIllegalStateTest
      PASSED........com.sun.ts.tests.portlet.api.javax_portlet.PortletSessionAppscope.URLClient.GetAttributeTest
      PASSED........com.sun.ts.tests.portlet.api.javax_portlet.PortletSessionAppscope.URLClient.GetAttributeIllegalStateTest
      PASSED........com.sun.ts.tests.portlet.api.javax_portlet.PortletSessionAppscope.URLClient.RemoveAttributeTest
      PASSED........com.sun.ts.tests.portlet.api.javax_portlet.PortletSessionAppscope.URLClient.RemoveAttributeIllegalStateTest
      PASSED........com.sun.ts.tests.portlet.api.javax_portlet.PortletSessionAppscope.URLClient.SetAttributeTest
      PASSED........com.sun.ts.tests.portlet.api.javax_portlet.PortletSessionAppscope.URLClient.SetAttributeIllegalStateTest
      PASSED........com.sun.ts.tests.portlet.api.javax_portlet.PortletSessionAppscope.URLClient.GetAttributeNullTest
      PASSED........com.sun.ts.tests.portlet.api.javax_portlet.PortletSessionDistributableapp.SpecURLClient.CheckPortletInDistributeAppTest
      PASSED........com.sun.ts.tests.portlet.api.javax_portlet.PortletSessionPrivatescope.SpecURLClient.CheckAttributeNameInPrivateScopeTest
      PASSED........com.sun.ts.tests.portlet.api.javax_portlet.PortletSessionPrivatescope.SpecURLClient.CheckSessionAttrInPrivateScopeTest
      PASSED........com.sun.ts.tests.portlet.api.javax_portlet.PortletSessionPrivatescope.URLClient.GetAttributeNamesTest
      PASSED........com.sun.ts.tests.portlet.api.javax_portlet.PortletSessionPrivatescope.URLClient.GetAttributeNamesIllegalStateTest
      PASSED........com.sun.ts.tests.portlet.api.javax_portlet.PortletSessionPrivatescope.URLClient.GetAttributeTest
      PASSED........com.sun.ts.tests.portlet.api.javax_portlet.PortletSessionPrivatescope.URLClient.GetAttributeIllegalStateTest
      PASSED........com.sun.ts.tests.portlet.api.javax_portlet.PortletSessionPrivatescope.URLClient.RemoveAttributeTest
      PASSED........com.sun.ts.tests.portlet.api.javax_portlet.PortletSessionPrivatescope.URLClient.RemoveAttributeIllegalStateTest
      PASSED........com.sun.ts.tests.portlet.api.javax_portlet.PortletSessionPrivatescope.URLClient.SetAttributeTest
      PASSED........com.sun.ts.tests.portlet.api.javax_portlet.PortletSessionPrivatescope.URLClient.SetAttributeIllegalStateTest
      PASSED........com.sun.ts.tests.portlet.api.javax_portlet.PortletSessionPrivatescope.URLClient.GetAttributeNullTest
      PASSED........com.sun.ts.tests.portlet.api.javax_portlet.PortletSessionUtil.URLClient.DecodeAttributeNameAppScopeTest
      PASSED........com.sun.ts.tests.portlet.api.javax_portlet.PortletSessionUtil.URLClient.DecodeScopeAppScopeTest
      PASSED........com.sun.ts.tests.portlet.api.javax_portlet.PortletSessionUtil.URLClient.DecodeAttributeNamePortletScopeTest
      PASSED........com.sun.ts.tests.portlet.api.javax_portlet.PortletSessionUtil.URLClient.DecodeScopePortletScopeTest
      PASSED........com.sun.ts.tests.portlet.api.javax_portlet.PortletURL.SpecURLClient.ProcessActionNotCalledForRenderURLTest
      PASSED........com.sun.ts.tests.portlet.api.javax_portlet.PortletURL.SpecURLClient.CheckSetParameterNameTest
      PASSED........com.sun.ts.tests.portlet.api.javax_portlet.PortletURL.SpecURLClient.CheckPortletContainerEncodingTest
      PASSED........com.sun.ts.tests.portlet.api.javax_portlet.PortletURL.SpecURLClient.CheckDefaultPortletModeTest
      PASSED........com.sun.ts.tests.portlet.api.javax_portlet.PortletURL.SpecURLClient.CheckDefaultWindowStateTest
      PASSED........com.sun.ts.tests.portlet.api.javax_portlet.PortletURL.URLClient.SetParameterWithValuesIllegalArgumentExceptionTest
      PASSED........com.sun.ts.tests.portlet.api.javax_portlet.PortletURL.URLClient.SetParameterIllegalArgumentExceptionTest
      PASSED........com.sun.ts.tests.portlet.api.javax_portlet.PortletURL.URLClient.SetParameterTest
      PASSED........com.sun.ts.tests.portlet.api.javax_portlet.PortletURL.URLClient.SetParameterWithValuesTest
      PASSED........com.sun.ts.tests.portlet.api.javax_portlet.PortletURL.URLClient.SetParametersIllegalArgumentExceptionTest
      PASSED........com.sun.ts.tests.portlet.api.javax_portlet.PortletURL.URLClient.SetParametersTest
      PASSED........com.sun.ts.tests.portlet.api.javax_portlet.PortletURL.URLClient.SetPortletModeTest
      PASSED........com.sun.ts.tests.portlet.api.javax_portlet.PortletURL.URLClient.SetPortletModeExceptionTest
      PASSED........com.sun.ts.tests.portlet.api.javax_portlet.PortletURL.URLClient.SetWindowStateExceptionTest
      PASSED........com.sun.ts.tests.portlet.api.javax_portlet.PortletURL.URLClient.ToStringTest
      PASSED........com.sun.ts.tests.portlet.api.javax_portlet.PortletURLListener.SpecURLClient.CheckFilterActionURLTest
      PASSED........com.sun.ts.tests.portlet.api.javax_portlet.PortletURLListener.SpecURLClient.CheckFilterRenderURLTest
      PASSED........com.sun.ts.tests.portlet.api.javax_portlet.PortletURLListener.SpecURLClient.CheckFilterResourceURLTest
      PASSED........com.sun.ts.tests.portlet.api.javax_portlet.PortletURLListener.SpecURLClient.IsPortletURLInPortletURLGenerationListenerTest
      PASSED........com.sun.ts.tests.portlet.api.javax_portlet.PortletURLListener.SpecURLClient.IsResourceURLInPortletURLGenerationListenerTest
      PASSED........com.sun.ts.tests.portlet.api.javax_portlet.PortletURLListener.SpecURLClient.CheckPortletURLGenerationListenerChainTest
      PASSED........com.sun.ts.tests.portlet.api.javax_portlet.ReadOnlyException.URLClient.ReadOnlyExceptionCtr1Test
      PASSED........com.sun.ts.tests.portlet.api.javax_portlet.ReadOnlyException.URLClient.ReadOnlyExceptionCtr2Test
      PASSED........com.sun.ts.tests.portlet.api.javax_portlet.ReadOnlyException.URLClient.ReadOnlyExceptionCtr3Test
      PASSED........com.sun.ts.tests.portlet.api.javax_portlet.RenderRequest.SpecURLClient.GetRenderParametersForOnlyTargetTest
      PASSED........com.sun.ts.tests.portlet.api.javax_portlet.RenderRequest.SpecURLClient.GetParameterOnlySeenByTargetTest
      PASSED........com.sun.ts.tests.portlet.api.javax_portlet.RenderRequest.SpecURLClient.CheckSingleParameterValuesTest
      PASSED........com.sun.ts.tests.portlet.api.javax_portlet.RenderRequest.SpecURLClient.GetContextPathSyntaxTest
      PASSED........com.sun.ts.tests.portlet.api.javax_portlet.RenderRequest.SpecURLClient.ResponseContentTypesOnlySupportedByPortletTest
      PASSED........com.sun.ts.tests.portlet.api.javax_portlet.RenderRequest.SpecURLClient.GetPublicParameterOnlySeenByTargetTest
      PASSED........com.sun.ts.tests.portlet.api.javax_portlet.RenderRequest.SpecURLClient.GetPublicParameterMapTest
      PASSED........com.sun.ts.tests.portlet.api.javax_portlet.RenderRequest.SpecURLClient.GetPublicParameterTest
      PASSED........com.sun.ts.tests.portlet.api.javax_portlet.RenderRequest.SpecURLClient.GetPublicParameterLastEntryTest
      PASSED........com.sun.ts.tests.portlet.api.javax_portlet.RenderRequest.SpecURLClient.GetLifecyclePhaseAttributeTest
      PASSED........com.sun.ts.tests.portlet.api.javax_portlet.RenderRequest.SpecURLClient.ResponseContentTypeOnlyIncludesMimeTypesTest
      PASSED........com.sun.ts.tests.portlet.api.javax_portlet.RenderRequest.SpecURLClient.GetWindowIDPortletScopeTest
      PASSED........com.sun.ts.tests.portlet.api.javax_portlet.RenderRequest.SpecURLClient.GetCCPPAttributeTest
      PASSED........com.sun.ts.tests.portlet.api.javax_portlet.RenderRequest.URLClient.GetAttributeIllegalArgumentExceptionTest
      PASSED........com.sun.ts.tests.portlet.api.javax_portlet.RenderRequest.URLClient.GetAttributeNamesTest
      PASSED........com.sun.ts.tests.portlet.api.javax_portlet.RenderRequest.URLClient.GetAttributeTest
      PASSED........com.sun.ts.tests.portlet.api.javax_portlet.RenderRequest.URLClient.GetAttributeInvalidTest
      PASSED........com.sun.ts.tests.portlet.api.javax_portlet.RenderRequest.URLClient.GetAuthTypeWithoutProtectionTest
      PASSED........com.sun.ts.tests.portlet.api.javax_portlet.RenderRequest.URLClient.GetContextPathTest
      PASSED........com.sun.ts.tests.portlet.api.javax_portlet.RenderRequest.URLClient.GetLocaleTest
      PASSED........com.sun.ts.tests.portlet.api.javax_portlet.RenderRequest.URLClient.GetLocalesTest
      PASSED........com.sun.ts.tests.portlet.api.javax_portlet.RenderRequest.URLClient.GetParameterIllegalArgumentExceptionTest
      PASSED........com.sun.ts.tests.portlet.api.javax_portlet.RenderRequest.URLClient.GetParameterNamesTest
      PASSED........com.sun.ts.tests.portlet.api.javax_portlet.RenderRequest.URLClient.GetParameterTest
      PASSED........com.sun.ts.tests.portlet.api.javax_portlet.RenderRequest.URLClient.GetParameterValuesIllegalArgumentExceptionTest
      PASSED........com.sun.ts.tests.portlet.api.javax_portlet.RenderRequest.URLClient.GetParameterValuesTest
      PASSED........com.sun.ts.tests.portlet.api.javax_portlet.RenderRequest.URLClient.GetPortalContextTest
      PASSED........com.sun.ts.tests.portlet.api.javax_portlet.RenderRequest.URLClient.GetPortletModeTest
      PASSED........com.sun.ts.tests.portlet.api.javax_portlet.RenderRequest.URLClient.GetPortletSessionTest
      PASSED........com.sun.ts.tests.portlet.api.javax_portlet.RenderRequest.URLClient.GetPreferencesTest
      PASSED........com.sun.ts.tests.portlet.api.javax_portlet.RenderRequest.URLClient.GetPortletSessionParamTest
      PASSED........com.sun.ts.tests.portlet.api.javax_portlet.RenderRequest.URLClient.GetWindowStateTest
      PASSED........com.sun.ts.tests.portlet.api.javax_portlet.RenderRequest.URLClient.GetParameterMapTest
      PASSED........com.sun.ts.tests.portlet.api.javax_portlet.RenderRequest.URLClient.GetParameterMapEmptyTest
      PASSED........com.sun.ts.tests.portlet.api.javax_portlet.RenderRequest.URLClient.GetParameterNamesEmptyTest
      PASSED........com.sun.ts.tests.portlet.api.javax_portlet.RenderRequest.URLClient.GetInvalidParameterTest
      PASSED........com.sun.ts.tests.portlet.api.javax_portlet.RenderRequest.URLClient.GetRemoteUserNullTest
      PASSED........com.sun.ts.tests.portlet.api.javax_portlet.RenderRequest.URLClient.GetResponseContentTypeTest
      PASSED........com.sun.ts.tests.portlet.api.javax_portlet.RenderRequest.URLClient.GetResponseContentTypesTest
      PASSED........com.sun.ts.tests.portlet.api.javax_portlet.RenderRequest.URLClient.GetSchemeTest
      PASSED........com.sun.ts.tests.portlet.api.javax_portlet.RenderRequest.URLClient.GetServerNameTest
      PASSED........com.sun.ts.tests.portlet.api.javax_portlet.RenderRequest.URLClient.GetServerPortTest
      PASSED........com.sun.ts.tests.portlet.api.javax_portlet.RenderRequest.URLClient.CheckIsPortletModeAllowedTest
      PASSED........com.sun.ts.tests.portlet.api.javax_portlet.RenderRequest.URLClient.IsRequestedSessionIdValidForValidSessionTest
      PASSED........com.sun.ts.tests.portlet.api.javax_portlet.RenderRequest.URLClient.IsRequestedSessionIdValidForInvalidSessionTest
      PASSED........com.sun.ts.tests.portlet.api.javax_portlet.RenderRequest.URLClient.CheckIsWindowStateAllowedTest
      PASSED........com.sun.ts.tests.portlet.api.javax_portlet.RenderRequest.URLClient.RemoveAttributeIllegalArgumentExceptionTest
      PASSED........com.sun.ts.tests.portlet.api.javax_portlet.RenderRequest.URLClient.RemoveAttributeTest
      PASSED........com.sun.ts.tests.portlet.api.javax_portlet.RenderRequest.URLClient.SetAttributeIllegalArgumentExceptionTest
      PASSED........com.sun.ts.tests.portlet.api.javax_portlet.RenderRequest.URLClient.SetAttributeTest
      PASSED........com.sun.ts.tests.portlet.api.javax_portlet.RenderResponse.SpecURLClient.GetNullContentTypeTest
      PASSED........com.sun.ts.tests.portlet.api.javax_portlet.RenderResponse.SpecURLClient.ValidIdentifierTest
      PASSED........com.sun.ts.tests.portlet.api.javax_portlet.RenderResponse.SpecURLClient.GetNamespaceSameValueTest
      PASSED........com.sun.ts.tests.portlet.api.javax_portlet.RenderResponse.URLClient.CreateActionURLTest
      PASSED........com.sun.ts.tests.portlet.api.javax_portlet.RenderResponse.URLClient.CreateRenderURLTest
      PASSED........com.sun.ts.tests.portlet.api.javax_portlet.RenderResponse.URLClient.EncodeURLIllegalArgumentExceptionTest
      PASSED........com.sun.ts.tests.portlet.api.javax_portlet.RenderResponse.URLClient.EncodeURLTest
      PASSED........com.sun.ts.tests.portlet.api.javax_portlet.RenderResponse.URLClient.FlushBufferTest
      PASSED........com.sun.ts.tests.portlet.api.javax_portlet.RenderResponse.URLClient.GetBufferSizeTest
      PASSED........com.sun.ts.tests.portlet.api.javax_portlet.RenderResponse.URLClient.GetCharacterEncodingTest
      PASSED........com.sun.ts.tests.portlet.api.javax_portlet.RenderResponse.URLClient.GetContentTypeTest
      PASSED........com.sun.ts.tests.portlet.api.javax_portlet.RenderResponse.URLClient.GetLocaleTest
      PASSED........com.sun.ts.tests.portlet.api.javax_portlet.RenderResponse.URLClient.GetNamespaceTest
      PASSED........com.sun.ts.tests.portlet.api.javax_portlet.RenderResponse.URLClient.GetPortletOutputStreamAfterGetWriterTest
      PASSED........com.sun.ts.tests.portlet.api.javax_portlet.RenderResponse.URLClient.GetPortletOutputStreamTest
      PASSED........com.sun.ts.tests.portlet.api.javax_portlet.RenderResponse.URLClient.GetWriterAfterGetPortletOutputStreamTest
      PASSED........com.sun.ts.tests.portlet.api.javax_portlet.RenderResponse.URLClient.GetWriterTest
      PASSED........com.sun.ts.tests.portlet.api.javax_portlet.RenderResponse.URLClient.IsCommittedTest
      PASSED........com.sun.ts.tests.portlet.api.javax_portlet.RenderResponse.URLClient.ResetBufferIllegalStateExceptionTest
      PASSED........com.sun.ts.tests.portlet.api.javax_portlet.RenderResponse.URLClient.ResetBufferTest
      PASSED........com.sun.ts.tests.portlet.api.javax_portlet.RenderResponse.URLClient.ResetIllegalStateExceptionTest
      PASSED........com.sun.ts.tests.portlet.api.javax_portlet.RenderResponse.URLClient.ResetTest
      PASSED........com.sun.ts.tests.portlet.api.javax_portlet.RenderResponse.URLClient.SetBufferSizeTest
      PASSED........com.sun.ts.tests.portlet.api.javax_portlet.RenderResponse.URLClient.SetContentTypeTest
      FAILED........com.sun.ts.tests.portlet.api.javax_portlet.RenderResponse.URLClient.SetInvalidContentTypeTest
      PASSED........com.sun.ts.tests.portlet.api.javax_portlet.ResourceRequest.SpecURLClient.GetParameterValuesTest
      PASSED........com.sun.ts.tests.portlet.api.javax_portlet.ResourceRequest.SpecURLClient.CheckSingleParameterValuesTest
      PASSED........com.sun.ts.tests.portlet.api.javax_portlet.ResourceRequest.SpecURLClient.GetParameterMapTest
      PASSED........com.sun.ts.tests.portlet.api.javax_portlet.ResourceRequest.SpecURLClient.GetParameterMapEmptyTest
      PASSED........com.sun.ts.tests.portlet.api.javax_portlet.ResourceRequest.SpecURLClient.GetLifecyclePhaseAttributeTest
      PASSED........com.sun.ts.tests.portlet.api.javax_portlet.ResourceRequest.SpecURLClient.GetContextPathSyntaxTest
      PASSED........com.sun.ts.tests.portlet.api.javax_portlet.ResourceRequest.SpecURLClient.GetAuthTypeWithoutProtectionTest
      PASSED........com.sun.ts.tests.portlet.api.javax_portlet.ResourceResponse.SpecURLClient.GetNamespaceSameValueTest
      PASSED........com.sun.ts.tests.portlet.api.javax_portlet.ResourceResponse.SpecURLClient.GetNullContentTypeTest
      PASSED........com.sun.ts.tests.portlet.api.javax_portlet.ResourceResponse.SpecURLClient.GetContentTypeTest
      PASSED........com.sun.ts.tests.portlet.api.javax_portlet.ResourceResponse.SpecURLClient.GetWriterAfterGetPortletOutputStreamTest
      PASSED........com.sun.ts.tests.portlet.api.javax_portlet.ResourceResponse.SpecURLClient.GetPortletOutputStreamAfterGetWriterTest
      PASSED........com.sun.ts.tests.portlet.api.javax_portlet.ResourceResponse.SpecURLClient.GetBufferSizeTest
      PASSED........com.sun.ts.tests.portlet.api.javax_portlet.ResourceResponse.SpecURLClient.SetBufferSizeTest
      PASSED........com.sun.ts.tests.portlet.api.javax_portlet.ResourceResponse.SpecURLClient.ResetBufferIllegalStateExceptionTest
      PASSED........com.sun.ts.tests.portlet.api.javax_portlet.ResourceResponse.SpecURLClient.ResetIllegalStateExceptionTest
      PASSED........com.sun.ts.tests.portlet.api.javax_portlet.ResourceServing.SpecURLClient.GetMethodTest
      PASSED........com.sun.ts.tests.portlet.api.javax_portlet.ResourceServing.SpecURLClient.GetResourceIDTest
      PASSED........com.sun.ts.tests.portlet.api.javax_portlet.ResourceServing.SpecURLClient.GetNoResourceIDTest
      PASSED........com.sun.ts.tests.portlet.api.javax_portlet.ResourceServing.SpecURLClient.GetCreateResourceURLTest
      PASSED........com.sun.ts.tests.portlet.api.javax_portlet.ResourceServing.SpecURLClient.CheckProcessActionNotCalledForResourceURLTest
      PASSED........com.sun.ts.tests.portlet.api.javax_portlet.ResourceServing.SpecURLClient.CheckResourceURLNotChangePortletModeTest
      PASSED........com.sun.ts.tests.portlet.api.javax_portlet.ResourceServing.SpecURLClient.CheckNoFULLCachabilityTest
      PASSED........com.sun.ts.tests.portlet.api.javax_portlet.ResourceServing.SpecURLClient.CheckNoFULLResourceURLTest
      PASSED........com.sun.ts.tests.portlet.api.javax_portlet.ResourceServing.SpecURLClient.CheckNoPORTLETResourceURLTest
      PASSED........com.sun.ts.tests.portlet.api.javax_portlet.UnavailableException.URLClient.UnavailableExceptionCtr1Test
      PASSED........com.sun.ts.tests.portlet.api.javax_portlet.UnavailableException.URLClient.UnavailableExceptionCtr2Test
      PASSED........com.sun.ts.tests.portlet.api.javax_portlet.UnavailableException.URLClient.IsPermanentTest
      PASSED........com.sun.ts.tests.portlet.api.javax_portlet.ValidatorException.URLClient.GetFailedKeysEmptyTest
      PASSED........com.sun.ts.tests.portlet.api.javax_portlet.ValidatorException.URLClient.ValidatorExceptionCtr1Test
      PASSED........com.sun.ts.tests.portlet.api.javax_portlet.ValidatorException.URLClient.ValidatorExceptionCtr2Test
      PASSED........com.sun.ts.tests.portlet.api.javax_portlet.ValidatorException.URLClient.ValidatorExceptionCtr3Test
      PASSED........com.sun.ts.tests.portlet.api.javax_portlet.WindowState.URLClient.EqualsTest
      PASSED........com.sun.ts.tests.portlet.api.javax_portlet.WindowState.URLClient.HashCodeTest
      PASSED........com.sun.ts.tests.portlet.api.javax_portlet.WindowState.URLClient.ToStringTest
      PASSED........com.sun.ts.tests.portlet.api.javax_portlet.WindowState.URLClient.CheckWindowStateMaxTest
      PASSED........com.sun.ts.tests.portlet.api.javax_portlet.WindowState.URLClient.CheckWindowStateMinTest
      PASSED........com.sun.ts.tests.portlet.api.javax_portlet.WindowState.URLClient.CheckWindowStateNormalTest
      PASSED........com.sun.ts.tests.portlet.api.javax_portlet.WindowStateException.URLClient.WindowStateExceptionCtr1Test
      PASSED........com.sun.ts.tests.portlet.api.javax_portlet.WindowStateException.URLClient.WindowStateExceptionCtr2Test
      PASSED........com.sun.ts.tests.portlet.api.javax_portlet.WindowStateException.URLClient.WindowStateExceptionCtr3Test
      PASSED........com.sun.ts.tests.portlet.ee.ClassLoader.SpecURLClient.GetResourceInJarTest
      PASSED........com.sun.ts.tests.portlet.ee.taglib.SpecURLClient.ActionURLCopyCurrentRenderParametersAppendTest
      PASSED........com.sun.ts.tests.portlet.ee.taglib.SpecURLClient.ActionURLCopyCurrentRenderParametersTest
      PASSED........com.sun.ts.tests.portlet.ee.taglib.SpecURLClient.ActionURLEscapeXmlTest
      PASSED........com.sun.ts.tests.portlet.ee.taglib.SpecURLClient.ActionURLIllegalPortletModeTest
      PASSED........com.sun.ts.tests.portlet.ee.taglib.SpecURLClient.ActionURLIllegalWindowStateTest
      PASSED........com.sun.ts.tests.portlet.ee.taglib.SpecURLClient.ActionURLPortletModeNotSetTest
      PASSED........com.sun.ts.tests.portlet.ee.taglib.SpecURLClient.ActionURLPortletModeTest
      PASSED........com.sun.ts.tests.portlet.ee.taglib.SpecURLClient.ActionURLTest
      PASSED........com.sun.ts.tests.portlet.ee.taglib.SpecURLClient.ActionURLVarInLoopTest
      PASSED........com.sun.ts.tests.portlet.ee.taglib.SpecURLClient.ActionURLVarTest
      PASSED........com.sun.ts.tests.portlet.ee.taglib.SpecURLClient.DefineObjectsProcessActionTest
      PASSED........com.sun.ts.tests.portlet.ee.taglib.SpecURLClient.DefineObjectsProcessEventTest
      PASSED........com.sun.ts.tests.portlet.ee.taglib.SpecURLClient.DefineObjectsRenderTest
      PASSED........com.sun.ts.tests.portlet.ee.taglib.SpecURLClient.DefineObjectsServeResourceTest
      PASSED........com.sun.ts.tests.portlet.ee.taglib.SpecURLClient.NamespaceTagUniquenessTest
      PASSED........com.sun.ts.tests.portlet.ee.taglib.SpecURLClient.PortletTaglibImplementedTest
      PASSED........com.sun.ts.tests.portlet.ee.taglib.SpecURLClient.RenderURLCopyCurrentRenderParametersAppendTest
      PASSED........com.sun.ts.tests.portlet.ee.taglib.SpecURLClient.RenderURLCopyCurrentRenderParametersTest
      PASSED........com.sun.ts.tests.portlet.ee.taglib.SpecURLClient.RenderURLEscapeXmlTest
      PASSED........com.sun.ts.tests.portlet.ee.taglib.SpecURLClient.RenderURLIllegalPortletModeTest
      PASSED........com.sun.ts.tests.portlet.ee.taglib.SpecURLClient.RenderURLIllegalWindowStateTest
      PASSED........com.sun.ts.tests.portlet.ee.taglib.SpecURLClient.RenderURLPortletModeNotSetTest
      PASSED........com.sun.ts.tests.portlet.ee.taglib.SpecURLClient.RenderURLPortletModeTest
      PASSED........com.sun.ts.tests.portlet.ee.taglib.SpecURLClient.RenderURLTest
      PASSED........com.sun.ts.tests.portlet.ee.taglib.SpecURLClient.RenderURLVarInLoopTest
      PASSED........com.sun.ts.tests.portlet.ee.taglib.SpecURLClient.RenderURLVarTest
      PASSED........com.sun.ts.tests.portlet.ee.taglib.SpecURLClient.ResourceURLAppendParameterTest
      PASSED........com.sun.ts.tests.portlet.ee.taglib.SpecURLClient.ResourceURLEscapeXmlTest
      PASSED........com.sun.ts.tests.portlet.ee.taglib.SpecURLClient.ResourceURLPreservesPortletModeTest
      PASSED........com.sun.ts.tests.portlet.ee.taglib.SpecURLClient.ResourceURLPreservesRenderParametersTest
      PASSED........com.sun.ts.tests.portlet.ee.taglib.SpecURLClient.ResourceURLPreservesWindowStateTest
      PASSED........com.sun.ts.tests.portlet.ee.taglib.SpecURLClient.ResourceURLTest
      PASSED........com.sun.ts.tests.portlet.ee.taglib.SpecURLClient.ResourceURLVarInLoopTest
      PASSED........com.sun.ts.tests.portlet.ee.taglib.SpecURLClient.ResourceURLVarOverwriteTest
      PASSED........com.sun.ts.tests.portlet.ee.taglib.SpecURLClient.ResourceURLVarTest
      PASSED........com.sun.ts.tests.portlet.Signature.PORTLETSigTest.SignatureTest
      Test results: passed: 626; failed: 3
      Results written to L:\public\master-portal\tools\tck\work.
      Error: Some tests did not pass

        Attachments

          Activity

            People

            • Votes:
              0 Vote for this issue
              Watchers:
              2 Start watching this issue

              Dates

              • Created:
                Updated:
                Resolved:
                Days since last comment:
                5 years, 26 weeks, 6 days ago