Details

    • Fix Priority:
      5

      Description

      Tomcat 7.0.42 + MySQL 5.5.38. Portal master GIT ID: c292ddf97ff78776773d5f0f6b428c13d976a2cb.
      Plugins master GIT ID: ed1d80d699082fe6578974f5e21ee8815fbe64f9.

      Steps to reproduce:

      1. From the kaleo-web directory, run:
        ant clean war
        

      Expected results:
      Kaleo-web should compile.

      Actual results:
      Kaleo-web doesn't compile.

      Console output:

      Buildfile: /opt/dev/projects/github/liferay-plugins-ee/liferay-plugins-ee-7.0.x/webs/kaleo-web/build.xml
      
      clean:
         [delete] Deleting directory /opt/dev/projects/github/liferay-plugins-ee/liferay-plugins-ee-7.0.x/webs/kaleo-web/docroot/WEB-INF/classes
      
      war:
          [mkdir] Created dir: /opt/dev/projects/github/liferay-plugins-ee/liferay-plugins-ee-7.0.x/webs/kaleo-web/docroot/WEB-INF/classes
           [copy] Copying 5 files to /opt/dev/projects/github/liferay-plugins-ee/liferay-plugins-ee-7.0.x/webs/kaleo-web/docroot/WEB-INF/lib
           [copy] Copying 5 files to /opt/dev/projects/github/liferay-plugins-ee/liferay-plugins-ee-7.0.x/webs/kaleo-web/docroot/WEB-INF/lib
           [copy] Copying 18 files to /opt/dev/projects/github/liferay-plugins-ee/liferay-plugins-ee-7.0.x/webs/kaleo-web/docroot/WEB-INF/classes
           [copy] Copied 47 empty directories to 37 empty directories under /opt/dev/projects/github/liferay-plugins-ee/liferay-plugins-ee-7.0.x/webs/kaleo-web/docroot/WEB-INF/classes
          [javac] Compiling 271 source files to /opt/dev/projects/github/liferay-plugins-ee/liferay-plugins-ee-7.0.x/webs/kaleo-web/docroot/WEB-INF/classes
          [javac] /opt/dev/projects/github/liferay-plugins-ee/liferay-plugins-ee-7.0.x/webs/kaleo-web/docroot/WEB-INF/src/com/liferay/portal/workflow/kaleo/WorkflowTaskManagerImpl.java:116: error: cannot find symbol
          [javac] 			if (e instanceof DuplicateLockException) {
          [javac] 			    ^
          [javac]   symbol:   variable e
          [javac]   location: class WorkflowTaskManagerImpl
          [javac] /opt/dev/projects/github/liferay-plugins-ee/liferay-plugins-ee-7.0.x/webs/kaleo-web/docroot/WEB-INF/src/com/liferay/portal/workflow/kaleo/WorkflowTaskManagerImpl.java:124: error: cannot find symbol
          [javac] 				"Unable to lock workflow task " + workflowTaskInstanceId, e);
          [javac] 				                                                          ^
          [javac]   symbol:   variable e
          [javac]   location: class WorkflowTaskManagerImpl
          [javac] Note: Some input files use or override a deprecated API.
          [javac] Note: Recompile with -Xlint:deprecation for details.
          [javac] Note: Some input files use unchecked or unsafe operations.
          [javac] Note: Recompile with -Xlint:unchecked for details.
          [javac] 2 errors
      
      BUILD FAILED
      /opt/dev/projects/github/liferay-plugins-ee/liferay-plugins-ee-7.0.x/build-common.xml:2763: The following error occurred while executing this line:
      : The following error occurred while executing this line:
      /opt/dev/projects/github/liferay-plugins-ee/liferay-plugins-ee-7.0.x/build-common.xml:2349: The following error occurred while executing this line:
      /opt/dev/projects/github/liferay-plugins-ee/liferay-plugins-ee-7.0.x/build-common.xml:2436: The following error occurred while executing this line:
      : The following error occurred while executing this line:
      /opt/dev/projects/github/liferay-plugins-ee/liferay-plugins-ee-7.0.x/build-common.xml:432: The following error occurred while executing this line:
      /opt/dev/projects/github/liferay-plugins-ee/liferay-plugins-ee-7.0.x/build-common.xml:857: The following error occurred while executing this line:
      /opt/dev/projects/github/liferay-plugins-ee/liferay-plugins-ee-7.0.x/build-common.xml:740: Compile failed; see the compiler error output for details.
      
      Total time: 5 seconds
      

        Attachments

          Activity

            People

            • Assignee:
              victor.ware Victor Ware
              Reporter:
              jared.zimmerman Jared Zimmerman (Inactive)
              Participants of an Issue:
              Recent user:
              Esther Sanz
            • Votes:
              0 Vote for this issue
              Watchers:
              1 Start watching this issue

              Dates

              • Created:
                Updated:
                Resolved:
                Days since last comment:
                5 years, 44 weeks, 6 days ago

                Packages

                Version Package
                7.0.0 M3