Uploaded image for project: 'PUBLIC - Liferay Portal Community Edition'
  1. PUBLIC - Liferay Portal Community Edition
  2. LPS-54565

Jonas 5.2.3 compile failure for portal.template.xsl

    Details

    • Fix Priority:
      5
    • Application Servers:
      JOnAS 5.2

      Description

      https://test-2-1.liferay.com/job/test-portal-branch-upstream-frontend-jonas-mysql%5Bportal-acceptance%5D(master)/label_exp=!test-2-1,test=PortalSmokeTestCase%23testSmoke/

      Jonas fails to compile at portal.template.xsl.

           [exec] [ivy:retrieve] :: retrieving :: com.liferay#com.liferay.portal.template.xsl
           [exec] [ivy:retrieve]      confs: [default, internal]
           [exec] [ivy:retrieve]      1 artifacts copied, 0 already retrieved (753kB/15ms)
           [exec] [ivy:retrieve] :: retrieving :: com.liferay#com.liferay.portal.template.xsl
           [exec] [ivy:retrieve]      confs: [default, internal]
           [exec] [ivy:retrieve]      0 artifacts copied, 0 already retrieved (0kB/0ms)
           [exec]     [mkdir] Created dir: L:\git\private\master-portal\modules\portal\portal-template-xsl\classes
           [exec]      [copy] Copied 6 empty directories to 6 empty directories under L:\git\private\master-portal\modules\portal\portal-template-xsl\classes
           [exec]     [javac] Compiling 4 source files to L:\git\private\master-portal\modules\portal\portal-template-xsl\classes
           [exec]
           [exec] BUILD FAILED
           [exec] L:\git\private\master-portal\tools\sdk\build-common.xml:2931: The following error occurred while executing this line:
           [exec] : The following error occurred while executing this line:
           [exec] L:\git\private\master-portal\tools\sdk\build-common.xml:1372: The following error occurred while executing this line:
           [exec] : The following error occurred while executing this line:
           [exec] L:\git\private\master-portal\tools\sdk\build-common.xml:2886: The following error occurred while executing this line:
           [exec] : The following error occurred while executing this line:
           [exec] L:\git\private\master-portal\tools\sdk\build-common.xml:636: The following error occurred while executing this line:
           [exec] L:\git\private\master-portal\tools\sdk\build-common.xml:900: Compile failed; see the compiler error output for details.
           [exec]
           [exec] Total time: 4 minutes 2 seconds
           [exec]     [javac] L:\git\private\master-portal\modules\portal\portal-template-xsl\src\com\liferay\portal\template\xsl\XSLErrorListener.java:27: error: package org.apache.xml.utils does not exist
           [exec]     [javac] import org.apache.xml.utils.SAXSourceLocator;
           [exec]     [javac]                            ^
           [exec]     [javac] L:\git\private\master-portal\modules\portal\portal-template-xsl\src\com\liferay\portal\template\xsl\XSLErrorListener.java:28: error: package org.apache.xml.utils does not exist
           [exec]     [javac] import org.apache.xml.utils.WrappedRuntimeException;
           [exec]     [javac]                            ^
           [exec]     [javac] L:\git\private\master-portal\modules\portal\portal-template-xsl\src\com\liferay\portal\template\xsl\XSLErrorListener.java:87: error: cannot find symbol
           [exec]     [javac]                                 locator = new SAXSourceLocator((SAXParseException)cause);
           [exec]     [javac]                                               ^
           [exec]     [javac]   symbol:   class SAXSourceLocator
           [exec]     [javac]   location: class XSLErrorListener
           [exec]     [javac] L:\git\private\master-portal\modules\portal\portal-template-xsl\src\com\liferay\portal\template\xsl\XSLErrorListener.java:103: error: cannot find symbol
           [exec]     [javac]                         else if (cause instanceof WrappedRuntimeException) {
           [exec]     [javac]                                                   ^
           [exec]     [javac]   symbol:   class WrappedRuntimeException
           [exec]     [javac]   location: class XSLErrorListener
           [exec]     [javac] L:\git\private\master-portal\modules\portal\portal-template-xsl\src\com\liferay\portal\template\xsl\XSLErrorListener.java:104: error: cannot find symbol
           [exec]     [javac]                                 cause = ((WrappedRuntimeException)cause).getException();
           [exec]     [javac]                                           ^
           [exec]     [javac]   symbol:   class WrappedRuntimeException
           [exec]     [javac]   location: class XSLErrorListener
           [exec]     [javac] 5 errors
      
      BUILD FAILED
      L:\git\private\master-portal\build.xml:70: The following error occurred while executing this line:
      L:\git\private\master-portal\build.xml:364: The following error occurred while executing this line:
      L:\git\private\master-portal\build-common.xml:499: exec returned: 1
      

        Attachments

          Activity

            People

            • Votes:
              0 Vote for this issue
              Watchers:
              2 Start watching this issue

              Dates

              • Created:
                Updated:
                Resolved:
                Days since last comment:
                3 years, 35 weeks, 6 days ago

                Packages

                Version Package