Details

    • Fix Priority:
      5

      Description

      LPS-54959 removes com.liferay.portal.kernel.search.StringDistanceCalculatorUtil and LPS-54881 removes method com.liferay.portal.kernel.search.QueryTranslatorUtil.translateForSolr().

      % ant all
      
      Buildfile: /home/lcsontos/liferay/sources/liferay-plugins/webs/solr4-web/build.xml
      
      all:
      
      clean:
         [delete] Deleting directory /home/lcsontos/liferay/sources/liferay-plugins/webs/solr4-web/docroot/WEB-INF/lib
      
      deploy:
           [copy] Copying 1 file to /home/lcsontos/liferay/sources/liferay-plugins/webs/solr4-web/docroot/WEB-INF/lib
          [javac] Compiling 25 source files to /home/lcsontos/liferay/sources/liferay-plugins/shared/solr4-shared/classes
          [javac] /home/lcsontos/liferay/sources/liferay-plugins/shared/solr4-shared/src/com/liferay/portal/search/solr/SolrIndexSearcher.java:29: error: cannot find symbol
          [javac] import com.liferay.portal.kernel.search.QueryTranslatorUtil;
          [javac]                                        ^
          [javac]   symbol:   class QueryTranslatorUtil
          [javac]   location: package com.liferay.portal.kernel.search
          [javac] /home/lcsontos/liferay/sources/liferay-plugins/shared/solr4-shared/src/com/liferay/portal/search/solr/SolrQuerySuggester.java:24: error: cannot find symbol
          [javac] import com.liferay.portal.kernel.search.StringDistanceCalculatorUtil;
          [javac]                                        ^
          [javac]   symbol:   class StringDistanceCalculatorUtil
          [javac]   location: package com.liferay.portal.kernel.search
          [javac] /home/lcsontos/liferay/sources/liferay-plugins/shared/solr4-shared/src/com/liferay/portal/search/solr/SolrIndexSearcher.java:451: error: cannot find symbol
          [javac] 		QueryTranslatorUtil.translateForSolr(query);
          [javac] 		^
          [javac]   symbol:   variable QueryTranslatorUtil
          [javac]   location: class SolrIndexSearcher
          [javac] /home/lcsontos/liferay/sources/liferay-plugins/shared/solr4-shared/src/com/liferay/portal/search/solr/SolrQuerySuggester.java:296: error: cannot find symbol
          [javac] 					float distance = StringDistanceCalculatorUtil.getDistance(
          [javac] 					                 ^
          [javac]   symbol:   variable StringDistanceCalculatorUtil
          [javac]   location: class SolrQuerySuggester
          [javac] Note: /home/lcsontos/liferay/sources/liferay-plugins/shared/solr4-shared/src/com/liferay/portal/search/solr/SolrQuerySuggester.java uses unchecked or unsafe operations.
          [javac] Note: Recompile with -Xlint:unchecked for details.
          [javac] 4 errors
      
      BUILD FAILED
      /home/lcsontos/liferay/sources/liferay-plugins/build-common-plugin.xml:289: The following error occurred while executing this line:
      /home/lcsontos/liferay/sources/liferay-plugins/build-common.xml:2929: The following error occurred while executing this line:
      : The following error occurred while executing this line:
      /home/lcsontos/liferay/sources/liferay-plugins/build-common.xml:1362: The following error occurred while executing this line:
      : The following error occurred while executing this line:
      /home/lcsontos/liferay/sources/liferay-plugins/build-common.xml:2637: The following error occurred while executing this line:
      /home/lcsontos/liferay/sources/liferay-plugins/build-common.xml:2724: The following error occurred while executing this line:
      : The following error occurred while executing this line:
      /home/lcsontos/liferay/sources/liferay-plugins/build-common.xml:590: The following error occurred while executing this line:
      /home/lcsontos/liferay/sources/liferay-plugins/build-common.xml:921: The following error occurred while executing this line:
      : The following error occurred while executing this line:
      /home/lcsontos/liferay/sources/liferay-plugins/build-common.xml:708: The following error occurred while executing this line:
      /home/lcsontos/liferay/sources/liferay-plugins/build-common.xml:717: The following error occurred while executing this line:
      /home/lcsontos/liferay/sources/liferay-plugins/build-common.xml:756: The following error occurred while executing this line:
      : The following error occurred while executing this line:
      /home/lcsontos/liferay/sources/liferay-plugins/build-common.xml:1822: The following error occurred while executing this line:
      : The following error occurred while executing this line:
      /home/lcsontos/liferay/sources/liferay-plugins/build-common.xml:634: The following error occurred while executing this line:
      /home/lcsontos/liferay/sources/liferay-plugins/build-common.xml:898: Compile failed; see the compiler error output for details.
      
      Total time: 5 seconds
      

        Attachments

          Issue Links

            Activity

              People

              • Assignee:
                laszlo.csontos Laszlo Csontos (Inactive)
                Reporter:
                laszlo.csontos Laszlo Csontos (Inactive)
                Participants of an Issue:
                Recent user:
                Esther Sanz
              • Votes:
                0 Vote for this issue
                Watchers:
                0 Start watching this issue

                Dates

                • Created:
                  Updated:
                  Resolved:
                  Days since last comment:
                  4 years, 25 weeks, 5 days ago

                  Packages

                  Version Package
                  7.0.0 M6