Details

    • Story Points:
      9
    • Fix Priority:
      4

      Description

      Plugins master GIT ID: ded87f065a50a4644477c523abc9e69642a53af1.

      Steps to Reproduce:

      Compile Kaleo-web using the ant clean war command.

      Expected result:
      Kaleo-web compiles without errors.

      Actual result:
      Throws the following exceptions and kaleo-web fails to compile:

      Microsoft Windows [版本 6.1.7601]
      版权所有 (c) 2009 Microsoft Corporation。保留所有权利。
      
      D:\github\plugins\master\webs\kaleo-web>ant all
      Buildfile: D:\github\plugins\master\webs\kaleo-web\build.xml
      
      all:
      
      clean:
         [delete] Deleting directory D:\github\plugins\master\webs\kaleo-web\docroot\WEB-INF\classes
         [delete] Deleting: D:\github\plugins\master\dist\kaleo-web-7.0.0.1.war
      
      deploy:
          [mkdir] Created dir: D:\github\plugins\master\webs\kaleo-web\docroot\WEB-INF\classes
           [copy] Copying 5 files to D:\github\plugins\master\webs\kaleo-web\docroot\WEB-INF\lib
           [copy] Copying 5 files to D:\github\plugins\master\webs\kaleo-web\docroot\WEB-INF\lib
           [copy] Copying 18 files to D:\github\plugins\master\webs\kaleo-web\docroot\WEB-INF\classes
           [copy] Copied 49 empty directories to 39 empty directories under D:\github\plugins\master\webs\kaleo-web\docroot\WEB-INF\classes
          [javac] Compiling 284 source files to D:\github\plugins\master\webs\kaleo-web\docroot\WEB-INF\classes
          [javac] D:\github\plugins\master\webs\kaleo-web\docroot\WEB-INF\src\com\liferay\portal\workflow\kaleo\service\impl\KaleoInstanceLocalServiceImpl.java:36: 错误: 程序包com.liferay.portlet.exportimport.staging不存在
          [javac] import com.liferay.portlet.exportimport.staging.StagingUtil;
          [javac]                                                ^
          [javac] D:\github\plugins\master\webs\kaleo-web\docroot\WEB-INF\src\com\liferay\portal\workflow\kaleo\service\impl\KaleoInstanceTokenLocalServiceImpl.java:27: 错误: 程序包com.liferay.portlet.exportimport.staging不存在
          [javac] import com.liferay.portlet.exportimport.staging.StagingUtil;
          [javac]                                                ^
          [javac] D:\github\plugins\master\webs\kaleo-web\docroot\WEB-INF\src\com\liferay\portal\workflow\kaleo\service\impl\KaleoTaskInstanceTokenLocalServiceImpl.java:37: 错误: 程序包com.liferay.portlet.exportimport.staging不存在
          [javac] import com.liferay.portlet.exportimport.staging.StagingUtil;
          [javac]                                                ^
          [javac] D:\github\plugins\master\webs\kaleo-web\docroot\WEB-INF\src\com\liferay\portal\workflow\kaleo\service\impl\KaleoTimerInstanceTokenLocalServiceImpl.java:40: 错误: 程序包com.liferay.portlet.exportimport.staging不存在
          [javac] import com.liferay.portlet.exportimport.staging.StagingUtil;
          [javac]                                                ^
          [javac] D:\github\plugins\master\webs\kaleo-web\docroot\WEB-INF\src\com\liferay\portal\workflow\kaleo\service\impl\KaleoInstanceLocalServiceImpl.java:74: 错误: 找不到符号
          [javac]             long groupId = StagingUtil.getLiveGroupId(
          [javac]                            ^
          [javac]   符号:   变量 StagingUtil
          [javac]   位置: 类 KaleoInstanceLocalServiceImpl
          [javac] D:\github\plugins\master\webs\kaleo-web\docroot\WEB-INF\src\com\liferay\portal\workflow\kaleo\service\impl\KaleoInstanceTokenLocalServiceImpl.java:60: 错误: 找不到符号
          [javac]             long groupId = StagingUtil.getLiveGroupId(
          [javac]                            ^
          [javac]   符号:   变量 StagingUtil
          [javac]   位置: 类 KaleoInstanceTokenLocalServiceImpl
          [javac] D:\github\plugins\master\webs\kaleo-web\docroot\WEB-INF\src\com\liferay\portal\workflow\kaleo\service\impl\KaleoInstanceTokenLocalServiceImpl.java:200: 错误: 找不到符号
          [javac]             long groupId = StagingUtil.getLiveGroupId(
          [javac]                            ^
          [javac]   符号:   变量 StagingUtil
          [javac]   位置: 类 KaleoInstanceTokenLocalServiceImpl
          [javac] D:\github\plugins\master\webs\kaleo-web\docroot\WEB-INF\src\com\liferay\portal\workflow\kaleo\service\impl\KaleoTaskInstanceTokenLocalServiceImpl.java:75: 错误: 找不到符号
          [javac]             long groupId = StagingUtil.getLiveGroupId(
          [javac]                            ^
          [javac]   符号:   变量 StagingUtil
          [javac]   位置: 类 KaleoTaskInstanceTokenLocalServiceImpl
          [javac] D:\github\plugins\master\webs\kaleo-web\docroot\WEB-INF\src\com\liferay\portal\workflow\kaleo\service\impl\KaleoTimerInstanceTokenLocalServiceImpl.java:81: 错误: 找不到符号
          [javac]             long groupId = StagingUtil.getLiveGroupId(
          [javac]                            ^
          [javac]   符号:   变量 StagingUtil
          [javac]   位置: 类 KaleoTimerInstanceTokenLocalServiceImpl
          [javac] 注: 某些输入文件使用或覆盖了已过时的 API。
          [javac] 注: 有关详细信息, 请使用 -Xlint:deprecation 重新编译。
          [javac] 注: 某些输入文件使用了未经检查或不安全的操作。
          [javac] 注: 有关详细信息, 请使用 -Xlint:unchecked 重新编译。
          [javac] 9 个错误
      
      BUILD FAILED
      D:\github\plugins\master\build-common-plugin.xml:363: The following error occurred while executing this line:
      D:\github\plugins\master\build-common.xml:3255: The following error occurred while executing this line:
      : The following error occurred while executing this line:
      D:\github\plugins\master\build-common.xml:1488: The following error occurred while executing this line:
      : The following error occurred while executing this line:
      D:\github\plugins\master\build-common.xml:2923: The following error occurred while executing this line:
      D:\github\plugins\master\build-common.xml:3010: The following error occurred while executing this line:
      : The following error occurred while executing this line:
      D:\github\plugins\master\build-common.xml:670: The following error occurred while executing this line:
      D:\github\plugins\master\build-common.xml:1105: The following error occurred while executing this line:
      D:\github\plugins\master\build-common.xml:978: Compile failed; see the compiler error output for details.
      
      Total time: 8 seconds
      
      D:\github\plugins\master\webs\kaleo-web>ant all
      Buildfile: D:\github\plugins\master\webs\kaleo-web\build.xml
      
      all:
      
      clean:
         [delete] Deleting directory D:\github\plugins\master\webs\kaleo-web\docroot\WEB-INF\classes
      
      deploy:
          [mkdir] Created dir: D:\github\plugins\master\shared\portal-compat-shared\classes
           [copy] Copying 1 file to D:\github\plugins\master\shared\portal-compat-shared\classes
            [jar] Building jar: D:\github\plugins\master\dist\portal-compat-shared-7.0.0.1.jar
           [copy] Copying 1 file to D:\github\plugins\master\webs\kaleo-web\docroot\WEB-INF\lib
          [mkdir] Created dir: D:\github\plugins\master\webs\kaleo-web\docroot\WEB-INF\classes
           [copy] Copying 5 files to D:\github\plugins\master\webs\kaleo-web\docroot\WEB-INF\lib
           [copy] Copying 5 files to D:\github\plugins\master\webs\kaleo-web\docroot\WEB-INF\lib
           [copy] Copying 18 files to D:\github\plugins\master\webs\kaleo-web\docroot\WEB-INF\classes
           [copy] Copied 49 empty directories to 39 empty directories under D:\github\plugins\master\webs\kaleo-web\docroot\WEB-INF\classes
          [javac] Compiling 284 source files to D:\github\plugins\master\webs\kaleo-web\docroot\WEB-INF\classes
          [javac] D:\github\plugins\master\webs\kaleo-web\docroot\WEB-INF\src\com\liferay\portal\workflow\kaleo\service\impl\KaleoInstanceLocalServiceImpl.java:36: 错误: 程序包com.liferay.portlet.exportimport.staging不存在
          [javac] import com.liferay.portlet.exportimport.staging.StagingUtil;
          [javac]                                                ^
          [javac] D:\github\plugins\master\webs\kaleo-web\docroot\WEB-INF\src\com\liferay\portal\workflow\kaleo\service\impl\KaleoInstanceTokenLocalServiceImpl.java:27: 错误: 程序包com.liferay.portlet.exportimport.staging不存在
          [javac] import com.liferay.portlet.exportimport.staging.StagingUtil;
          [javac]                                                ^
          [javac] D:\github\plugins\master\webs\kaleo-web\docroot\WEB-INF\src\com\liferay\portal\workflow\kaleo\service\impl\KaleoTaskInstanceTokenLocalServiceImpl.java:37: 错误: 程序包com.liferay.portlet.exportimport.staging不存在
          [javac] import com.liferay.portlet.exportimport.staging.StagingUtil;
          [javac]                                                ^
          [javac] D:\github\plugins\master\webs\kaleo-web\docroot\WEB-INF\src\com\liferay\portal\workflow\kaleo\service\impl\KaleoTimerInstanceTokenLocalServiceImpl.java:40: 错误: 程序包com.liferay.portlet.exportimport.staging不存在
          [javac] import com.liferay.portlet.exportimport.staging.StagingUtil;
          [javac]                                                ^
          [javac] D:\github\plugins\master\webs\kaleo-web\docroot\WEB-INF\src\com\liferay\portal\workflow\kaleo\service\impl\KaleoInstanceLocalServiceImpl.java:74: 错误: 找不到符号
          [javac]             long groupId = StagingUtil.getLiveGroupId(
          [javac]                            ^
          [javac]   符号:   变量 StagingUtil
          [javac]   位置: 类 KaleoInstanceLocalServiceImpl
          [javac] D:\github\plugins\master\webs\kaleo-web\docroot\WEB-INF\src\com\liferay\portal\workflow\kaleo\service\impl\KaleoInstanceTokenLocalServiceImpl.java:60: 错误: 找不到符号
          [javac]             long groupId = StagingUtil.getLiveGroupId(
          [javac]                            ^
          [javac]   符号:   变量 StagingUtil
          [javac]   位置: 类 KaleoInstanceTokenLocalServiceImpl
          [javac] D:\github\plugins\master\webs\kaleo-web\docroot\WEB-INF\src\com\liferay\portal\workflow\kaleo\service\impl\KaleoInstanceTokenLocalServiceImpl.java:200: 错误: 找不到符号
          [javac]             long groupId = StagingUtil.getLiveGroupId(
          [javac]                            ^
          [javac]   符号:   变量 StagingUtil
          [javac]   位置: 类 KaleoInstanceTokenLocalServiceImpl
          [javac] D:\github\plugins\master\webs\kaleo-web\docroot\WEB-INF\src\com\liferay\portal\workflow\kaleo\service\impl\KaleoTaskInstanceTokenLocalServiceImpl.java:75: 错误: 找不到符号
          [javac]             long groupId = StagingUtil.getLiveGroupId(
          [javac]                            ^
          [javac]   符号:   变量 StagingUtil
          [javac]   位置: 类 KaleoTaskInstanceTokenLocalServiceImpl
          [javac] D:\github\plugins\master\webs\kaleo-web\docroot\WEB-INF\src\com\liferay\portal\workflow\kaleo\service\impl\KaleoTimerInstanceTokenLocalServiceImpl.java:81: 错误: 找不到符号
          [javac]             long groupId = StagingUtil.getLiveGroupId(
          [javac]                            ^
          [javac]   符号:   变量 StagingUtil
          [javac]   位置: 类 KaleoTimerInstanceTokenLocalServiceImpl
          [javac] 注: 某些输入文件使用或覆盖了已过时的 API。
          [javac] 注: 有关详细信息, 请使用 -Xlint:deprecation 重新编译。
          [javac] 注: 某些输入文件使用了未经检查或不安全的操作。
          [javac] 注: 有关详细信息, 请使用 -Xlint:unchecked 重新编译。
          [javac] 9 个错误
      
      BUILD FAILED
      D:\github\plugins\master\build-common-plugin.xml:363: The following error occurred while executing this line:
      D:\github\plugins\master\build-common.xml:3255: The following error occurred while executing this line:
      : The following error occurred while executing this line:
      D:\github\plugins\master\build-common.xml:1488: The following error occurred while executing this line:
      : The following error occurred while executing this line:
      D:\github\plugins\master\build-common.xml:2923: The following error occurred while executing this line:
      D:\github\plugins\master\build-common.xml:3010: The following error occurred while executing this line:
      : The following error occurred while executing this line:
      D:\github\plugins\master\build-common.xml:670: The following error occurred while executing this line:
      D:\github\plugins\master\build-common.xml:1105: The following error occurred while executing this line:
      D:\github\plugins\master\build-common.xml:978: Compile failed; see the compiler error output for details.
      
      Total time: 7 seconds
      
      D:\github\plugins\master\webs\kaleo-web>ant clean
      Buildfile: D:\github\plugins\master\webs\kaleo-web\build.xml
      
      clean:
         [delete] Deleting directory D:\github\plugins\master\webs\kaleo-web\docroot\WEB-INF\classes
      
      BUILD SUCCESSFUL
      Total time: 1 second
      
      D:\github\plugins\master\webs\kaleo-web>ant all
      Buildfile: D:\github\plugins\master\webs\kaleo-web\build.xml
      
      all:
      
      clean:
      
      deploy:
          [mkdir] Created dir: D:\github\plugins\master\webs\kaleo-web\docroot\WEB-INF\classes
           [copy] Copying 5 files to D:\github\plugins\master\webs\kaleo-web\docroot\WEB-INF\lib
           [copy] Copying 5 files to D:\github\plugins\master\webs\kaleo-web\docroot\WEB-INF\lib
           [copy] Copying 18 files to D:\github\plugins\master\webs\kaleo-web\docroot\WEB-INF\classes
           [copy] Copied 49 empty directories to 39 empty directories under D:\github\plugins\master\webs\kaleo-web\docroot\WEB-INF\classes
          [javac] Compiling 284 source files to D:\github\plugins\master\webs\kaleo-web\docroot\WEB-INF\classes
          [javac] D:\github\plugins\master\webs\kaleo-web\docroot\WEB-INF\src\com\liferay\portal\workflow\kaleo\service\impl\KaleoInstanceLocalServiceImpl.java:36: 错误: 程序包com.liferay.portlet.exportimport.staging不存在
          [javac] import com.liferay.portlet.exportimport.staging.StagingUtil;
          [javac]                                                ^
          [javac] D:\github\plugins\master\webs\kaleo-web\docroot\WEB-INF\src\com\liferay\portal\workflow\kaleo\service\impl\KaleoInstanceTokenLocalServiceImpl.java:27: 错误: 程序包com.liferay.portlet.exportimport.staging不存在
          [javac] import com.liferay.portlet.exportimport.staging.StagingUtil;
          [javac]                                                ^
          [javac] D:\github\plugins\master\webs\kaleo-web\docroot\WEB-INF\src\com\liferay\portal\workflow\kaleo\service\impl\KaleoTaskInstanceTokenLocalServiceImpl.java:37: 错误: 程序包com.liferay.portlet.exportimport.staging不存在
          [javac] import com.liferay.portlet.exportimport.staging.StagingUtil;
          [javac]                                                ^
          [javac] D:\github\plugins\master\webs\kaleo-web\docroot\WEB-INF\src\com\liferay\portal\workflow\kaleo\service\impl\KaleoTimerInstanceTokenLocalServiceImpl.java:40: 错误: 程序包com.liferay.portlet.exportimport.staging不存在
          [javac] import com.liferay.portlet.exportimport.staging.StagingUtil;
          [javac]                                                ^
          [javac] D:\github\plugins\master\webs\kaleo-web\docroot\WEB-INF\src\com\liferay\portal\workflow\kaleo\service\impl\KaleoInstanceLocalServiceImpl.java:74: 错误: 找不到符号
          [javac]             long groupId = StagingUtil.getLiveGroupId(
          [javac]                            ^
          [javac]   符号:   变量 StagingUtil
          [javac]   位置: 类 KaleoInstanceLocalServiceImpl
          [javac] D:\github\plugins\master\webs\kaleo-web\docroot\WEB-INF\src\com\liferay\portal\workflow\kaleo\service\impl\KaleoInstanceTokenLocalServiceImpl.java:60: 错误: 找不到符号
          [javac]             long groupId = StagingUtil.getLiveGroupId(
          [javac]                            ^
          [javac]   符号:   变量 StagingUtil
          [javac]   位置: 类 KaleoInstanceTokenLocalServiceImpl
          [javac] D:\github\plugins\master\webs\kaleo-web\docroot\WEB-INF\src\com\liferay\portal\workflow\kaleo\service\impl\KaleoInstanceTokenLocalServiceImpl.java:200: 错误: 找不到符号
          [javac]             long groupId = StagingUtil.getLiveGroupId(
          [javac]                            ^
          [javac]   符号:   变量 StagingUtil
          [javac]   位置: 类 KaleoInstanceTokenLocalServiceImpl
          [javac] D:\github\plugins\master\webs\kaleo-web\docroot\WEB-INF\src\com\liferay\portal\workflow\kaleo\service\impl\KaleoTaskInstanceTokenLocalServiceImpl.java:75: 错误: 找不到符号
          [javac]             long groupId = StagingUtil.getLiveGroupId(
          [javac]                            ^
          [javac]   符号:   变量 StagingUtil
          [javac]   位置: 类 KaleoTaskInstanceTokenLocalServiceImpl
          [javac] D:\github\plugins\master\webs\kaleo-web\docroot\WEB-INF\src\com\liferay\portal\workflow\kaleo\service\impl\KaleoTimerInstanceTokenLocalServiceImpl.java:81: 错误: 找不到符号
          [javac]             long groupId = StagingUtil.getLiveGroupId(
          [javac]                            ^
          [javac]   符号:   变量 StagingUtil
          [javac]   位置: 类 KaleoTimerInstanceTokenLocalServiceImpl
          [javac] 注: 某些输入文件使用或覆盖了已过时的 API。
          [javac] 注: 有关详细信息, 请使用 -Xlint:deprecation 重新编译。
          [javac] 注: 某些输入文件使用了未经检查或不安全的操作。
          [javac] 注: 有关详细信息, 请使用 -Xlint:unchecked 重新编译。
          [javac] 9 个错误
      
      BUILD FAILED
      D:\github\plugins\master\build-common-plugin.xml:363: The following error occurred while executing this line:
      D:\github\plugins\master\build-common.xml:3255: The following error occurred while executing this line:
      : The following error occurred while executing this line:
      D:\github\plugins\master\build-common.xml:1488: The following error occurred while executing this line:
      : The following error occurred while executing this line:
      D:\github\plugins\master\build-common.xml:2923: The following error occurred while executing this line:
      D:\github\plugins\master\build-common.xml:3010: The following error occurred while executing this line:
      : The following error occurred while executing this line:
      D:\github\plugins\master\build-common.xml:670: The following error occurred while executing this line:
      D:\github\plugins\master\build-common.xml:1105: The following error occurred while executing this line:
      D:\github\plugins\master\build-common.xml:978: Compile failed; see the compiler error output for details.
      
      Total time: 7 seconds
      
      D:\github\plugins\master\webs\kaleo-web>
      

        Attachments

          Activity

            People

            • Assignee:
              sherry.zhu Sherry Zhu
              Reporter:
              sherry.zhu Sherry Zhu
              Participants of an Issue:
              Recent user:
              Esther Sanz
            • Votes:
              0 Vote for this issue
              Watchers:
              2 Start watching this issue

              Dates

              • Created:
                Updated:
                Resolved:
                Days since last comment:
                5 years, 5 weeks, 1 day ago

                Packages

                Version Package
                7.0.0 M7