Details

      Description

      Compilation error:

           [exec]
           [exec] npm ERR!
           [exec] npm ERR! Additional logging details can be found in:
           [exec] :portal-cache:portal-cache-ehcache-provider:processResourcesnpm ERR!     C:\java\lp\liferay-portal\modules\frontend\frontend-js-polyfill-babel-web\b
      uild\node\npm-debug.log
           [exec] npm ERR! not ok code 0
           [exec]
           [exec] :frontend:frontend-js-polyfill-babel-web:downloadBabelCore FAILED
           [exec]
           [exec] FAILURE: Build failed with an exception.
           [exec]
           [exec] * What went wrong:
           [exec] Execution failed for task ':frontend:frontend-js-polyfill-babel-web:downloadBabelCore'.
           [exec] > Process 'command 'cmd'' finished with non-zero exit value -4058
           [exec]
           [exec] * Try:
           [exec] Run with --info or --debug option to get more log output.
           [exec]
           [exec] * Exception is:
           [exec] org.gradle.api.tasks.TaskExecutionException: Execution failed for task ':frontend:frontend-js-polyfill-babel-web:downloadBabelCore'.
           [exec]     at org.gradle.api.internal.tasks.execution.ExecuteActionsTaskExecuter.executeActions(ExecuteActionsTaskExecuter.java:69)
           [exec]     at org.gradle.api.internal.tasks.execution.ExecuteActionsTaskExecuter.execute(ExecuteActionsTaskExecuter.java:46)
           [exec]     at org.gradle.api.internal.tasks.execution.PostExecutionAnalysisTaskExecuter.execute(PostExecutionAnalysisTaskExecuter.java:35)
           [exec]     at org.gradle.api.internal.tasks.execution.SkipUpToDateTaskExecuter.execute(SkipUpToDateTaskExecuter.java:64)
           [exec]     at org.gradle.api.internal.tasks.execution.ValidatingTaskExecuter.execute(ValidatingTaskExecuter.java:58)
           [exec]     at org.gradle.api.internal.tasks.execution.SkipEmptySourceFilesTaskExecuter.execute(SkipEmptySourceFilesTaskExecuter.java:52)
           [exec]     at org.gradle.api.internal.tasks.execution.SkipTaskWithNoActionsExecuter.execute(SkipTaskWithNoActionsExecuter.java:52)
           [exec]     at org.gradle.api.internal.tasks.execution.SkipOnlyIfTaskExecuter.execute(SkipOnlyIfTaskExecuter.java:53)
           [exec]     at org.gradle.api.internal.tasks.execution.ExecuteAtMostOnceTaskExecuter.execute(ExecuteAtMostOnceTaskExecuter.java:43)
           [exec]     at org.gradle.execution.taskgraph.DefaultTaskGraphExecuter$EventFiringTaskWorker.execute(DefaultTaskGraphExecuter.java:208)
           [exec]     at org.gradle.execution.taskgraph.DefaultTaskGraphExecuter$EventFiringTaskWorker.execute(DefaultTaskGraphExecuter.java:186)
           [exec]     at org.gradle.execution.taskgraph.AbstractTaskPlanExecutor$TaskExecutorWorker.processTask(AbstractTaskPlanExecutor.java:62)
           [exec]     at org.gradle.execution.taskgraph.AbstractTaskPlanExecutor$TaskExecutorWorker.run(AbstractTaskPlanExecutor.java:50)
           [exec]     at org.gradle.internal.concurrent.ExecutorPolicy$CatchAndRecordFailures.onExecute(ExecutorPolicy.java:54)
           [exec]     at org.gradle.internal.concurrent.StoppableExecutorImpl$1.run(StoppableExecutorImpl.java:40)
           [exec] Caused by: org.gradle.process.internal.ExecException: Process 'command 'cmd'' finished with non-zero exit value -4058
           [exec]     at org.gradle.process.internal.DefaultExecHandle$ExecResultImpl.assertNormalExitValue(DefaultExecHandle.java:366)
           [exec]     at org.gradle.process.internal.DefaultExecAction.execute(DefaultExecAction.java:31)
           [exec]     at org.gradle.api.internal.file.DefaultFileOperations.exec(DefaultFileOperations.java:165)
           [exec]     at org.gradle.api.internal.project.AbstractProject.exec(AbstractProject.java:792)
           [exec]     at com.liferay.gradle.plugins.node.util.NodeExecutor.execute(NodeExecutor.java:44)
           [exec]     at com.liferay.gradle.plugins.node.tasks.ExecuteNodeTask.executeNode(ExecuteNodeTask.java:41)
           [exec]     at com.liferay.gradle.plugins.node.tasks.ExecuteNpmTask.executeNode(ExecuteNpmTask.java:26)
           [exec]     at com.liferay.gradle.plugins.node.tasks.DownloadNodeModuleTask.executeNode(DownloadNodeModuleTask.java:78)
           [exec]     at org.gradle.internal.reflect.JavaMethod.invoke(JavaMethod.java:75)
           [exec]     at org.gradle.api.internal.project.taskfactory.AnnotationProcessingTaskFactory$StandardTaskAction.doExecute(AnnotationProcessingTaskFactory.java
      :226)
           [exec]     at org.gradle.api.internal.project.taskfactory.AnnotationProcessingTaskFactory$StandardTaskAction.execute(AnnotationProcessingTaskFactory.java:2
      19)
           [exec]     at org.gradle.api.internal.project.taskfactory.AnnotationProcessingTaskFactory$StandardTaskAction.execute(AnnotationProcessingTaskFactory.java:2
      08)
           [exec]     at org.gradle.api.internal.AbstractTask$TaskActionWrapper.execute(AbstractTask.java:585)
           [exec]     at org.gradle.api.internal.AbstractTask$TaskActionWrapper.execute(AbstractTask.java:568)
           [exec]     at org.gradle.api.internal.tasks.execution.ExecuteActionsTaskExecuter.executeAction(ExecuteActionsTaskExecuter.java:80)
           [exec]     at org.gradle.api.internal.tasks.execution.ExecuteActionsTaskExecuter.executeActions(ExecuteActionsTaskExecuter.java:61)
           [exec]     ... 14 more
           [exec]
           [exec]
           [exec] BUILD FAILED
           [exec]
      

        Attachments

          Activity

            People

            • Votes:
              0 Vote for this issue
              Watchers:
              0 Start watching this issue

              Dates

              • Created:
                Updated:
                Resolved:
                Days since last comment:
                3 years, 47 weeks, 6 days ago

                Packages

                Version Package