Uploaded image for project: 'PUBLIC - Liferay Portal Community Edition'
  1. PUBLIC - Liferay Portal Community Edition
  2. LPS-62562

Sharepoint and Documentum hooks fail to compile on ee-7.0.x

    Details

      Description

      [/opt/dev/projects/github/liferay-plugins-ee-7.0.x/hooks/documentum-hook] (ee-7.0.x)
      sharon$ ant all
      Buildfile: /opt/dev/projects/github/liferay-plugins-ee-7.0.x/hooks/documentum-hook/build.xml
      
      all:
      
      clean:
         [delete] Deleting directory /opt/dev/projects/github/liferay-plugins-ee-7.0.x/hooks/documentum-hook/docroot/WEB-INF/classes
      
      deploy:
           [copy] Copying 1 file to /opt/dev/projects/github/liferay-plugins-ee-7.0.x/hooks/documentum-hook/docroot/WEB-INF/lib
          [mkdir] Created dir: /opt/dev/projects/github/liferay-plugins-ee-7.0.x/hooks/documentum-hook/docroot/WEB-INF/classes
           [copy] Copying 3 files to /opt/dev/projects/github/liferay-plugins-ee-7.0.x/hooks/documentum-hook/docroot/WEB-INF/lib
           [copy] Copying 5 files to /opt/dev/projects/github/liferay-plugins-ee-7.0.x/hooks/documentum-hook/docroot/WEB-INF/lib
           [copy] Copying 5 files to /opt/dev/projects/github/liferay-plugins-ee-7.0.x/hooks/documentum-hook/docroot/WEB-INF/classes
           [copy] Copied 8 empty directories to 6 empty directories under /opt/dev/projects/github/liferay-plugins-ee-7.0.x/hooks/documentum-hook/docroot/WEB-INF/classes
          [javac] Compiling 22 source files to /opt/dev/projects/github/liferay-plugins-ee-7.0.x/hooks/documentum-hook/docroot/WEB-INF/classes
          [javac] /opt/dev/projects/github/liferay-plugins-ee-7.0.x/hooks/documentum-hook/docroot/WEB-INF/src/com/liferay/documentum/repository/DocumentumRepository.java:43: error: cannot find symbol
          [javac] import com.liferay.portal.InvalidRepositoryException;
          [javac]                          ^
          [javac]   symbol:   class InvalidRepositoryException
          [javac]   location: package com.liferay.portal
          [javac] /opt/dev/projects/github/liferay-plugins-ee-7.0.x/hooks/documentum-hook/docroot/WEB-INF/src/com/liferay/documentum/repository/DocumentumRepository.java:62: error: cannot find symbol
          [javac] import com.liferay.portlet.documentlibrary.DuplicateFileException;
          [javac]                                           ^
          [javac]   symbol:   class DuplicateFileException
          [javac]   location: package com.liferay.portlet.documentlibrary
          [javac] /opt/dev/projects/github/liferay-plugins-ee-7.0.x/hooks/documentum-hook/docroot/WEB-INF/src/com/liferay/documentum/repository/DocumentumRepository.java:63: error: cannot find symbol
          [javac] import com.liferay.portlet.documentlibrary.DuplicateFolderNameException;
          [javac]                                           ^
          [javac]   symbol:   class DuplicateFolderNameException
          [javac]   location: package com.liferay.portlet.documentlibrary
          [javac] /opt/dev/projects/github/liferay-plugins-ee-7.0.x/hooks/documentum-hook/docroot/WEB-INF/src/com/liferay/documentum/repository/DocumentumRepository.java:64: error: cannot find symbol
          [javac] import com.liferay.portlet.documentlibrary.FileExtensionException;
          [javac]                                           ^
          [javac]   symbol:   class FileExtensionException
          [javac]   location: package com.liferay.portlet.documentlibrary
          [javac] /opt/dev/projects/github/liferay-plugins-ee-7.0.x/hooks/documentum-hook/docroot/WEB-INF/src/com/liferay/documentum/repository/DocumentumRepository.java:65: error: cannot find symbol
          [javac] import com.liferay.portlet.documentlibrary.NoSuchFileEntryException;
          [javac]                                           ^
          [javac]   symbol:   class NoSuchFileEntryException
          [javac]   location: package com.liferay.portlet.documentlibrary
          [javac] /opt/dev/projects/github/liferay-plugins-ee-7.0.x/hooks/documentum-hook/docroot/WEB-INF/src/com/liferay/documentum/repository/DocumentumRepository.java:66: error: cannot find symbol
          [javac] import com.liferay.portlet.documentlibrary.NoSuchFileVersionException;
          [javac]                                           ^
          [javac]   symbol:   class NoSuchFileVersionException
          [javac]   location: package com.liferay.portlet.documentlibrary
          [javac] /opt/dev/projects/github/liferay-plugins-ee-7.0.x/hooks/documentum-hook/docroot/WEB-INF/src/com/liferay/documentum/repository/DocumentumRepository.java:67: error: cannot find symbol
          [javac] import com.liferay.portlet.documentlibrary.NoSuchFolderException;
          [javac]                                           ^
          [javac]   symbol:   class NoSuchFolderException
          [javac]   location: package com.liferay.portlet.documentlibrary
          [javac] /opt/dev/projects/github/liferay-plugins-ee-7.0.x/hooks/documentum-hook/docroot/WEB-INF/src/com/liferay/documentum/repository/DocumentumRepository.java:770: error: cannot find symbol
          [javac] 		throws InvalidRepositoryException, PrincipalException {
          [javac] 		       ^
          [javac]   symbol:   class InvalidRepositoryException
          [javac]   location: class DocumentumRepository
          [javac] /opt/dev/projects/github/liferay-plugins-ee-7.0.x/hooks/documentum-hook/docroot/WEB-INF/src/com/liferay/documentum/repository/DocumentumRepository.java:128: error: cannot find symbol
          [javac] 					throw new FileExtensionException(
          [javac] 					          ^
          [javac]   symbol: class FileExtensionException
          [javac] /opt/dev/projects/github/liferay-plugins-ee-7.0.x/hooks/documentum-hook/docroot/WEB-INF/src/com/liferay/documentum/repository/DocumentumRepository.java:505: error: cannot find symbol
          [javac] 					throw new NoSuchFileVersionException(version);
          [javac] 					          ^
          [javac]   symbol: class NoSuchFileVersionException
          [javac] /opt/dev/projects/github/liferay-plugins-ee-7.0.x/hooks/documentum-hook/docroot/WEB-INF/src/com/liferay/documentum/repository/DocumentumRepository.java:589: error: cannot find symbol
          [javac] 						throw new NoSuchFolderException(extRepositoryObjectKey);
          [javac] 						          ^
          [javac]   symbol: class NoSuchFolderException
          [javac] /opt/dev/projects/github/liferay-plugins-ee-7.0.x/hooks/documentum-hook/docroot/WEB-INF/src/com/liferay/documentum/repository/DocumentumRepository.java:592: error: cannot find symbol
          [javac] 						throw new NoSuchFileEntryException(
          [javac] 						          ^
          [javac]   symbol: class NoSuchFileEntryException
          [javac] /opt/dev/projects/github/liferay-plugins-ee-7.0.x/hooks/documentum-hook/docroot/WEB-INF/src/com/liferay/documentum/repository/DocumentumRepository.java:632: error: cannot find symbol
          [javac] 					throw new NoSuchFileEntryException(sb.toString());
          [javac] 					          ^
          [javac]   symbol: class NoSuchFileEntryException
          [javac] /opt/dev/projects/github/liferay-plugins-ee-7.0.x/hooks/documentum-hook/docroot/WEB-INF/src/com/liferay/documentum/repository/DocumentumRepository.java:775: error: cannot find symbol
          [javac] 			throw new InvalidRepositoryException();
          [javac] 			          ^
          [javac]   symbol:   class InvalidRepositoryException
          [javac]   location: class DocumentumRepository
          [javac] /opt/dev/projects/github/liferay-plugins-ee-7.0.x/hooks/documentum-hook/docroot/WEB-INF/src/com/liferay/documentum/repository/DocumentumRepository.java:781: error: cannot find symbol
          [javac] 			throw new InvalidRepositoryException();
          [javac] 			          ^
          [javac]   symbol:   class InvalidRepositoryException
          [javac]   location: class DocumentumRepository
          [javac] /opt/dev/projects/github/liferay-plugins-ee-7.0.x/hooks/documentum-hook/docroot/WEB-INF/src/com/liferay/documentum/repository/DocumentumRepository.java:1019: error: cannot find symbol
          [javac] 						throw new FileExtensionException(
          [javac] 						          ^
          [javac]   symbol: class FileExtensionException
          [javac] /opt/dev/projects/github/liferay-plugins-ee-7.0.x/hooks/documentum-hook/docroot/WEB-INF/src/com/liferay/documentum/repository/DocumentumRepository.java:1412: error: cannot find symbol
          [javac] 			throw new DuplicateFileException(title);
          [javac] 			          ^
          [javac]   symbol:   class DuplicateFileException
          [javac]   location: class DocumentumRepository
          [javac] /opt/dev/projects/github/liferay-plugins-ee-7.0.x/hooks/documentum-hook/docroot/WEB-INF/src/com/liferay/documentum/repository/DocumentumRepository.java:1420: error: cannot find symbol
          [javac] 			throw new DuplicateFolderNameException(title);
          [javac] 			          ^
          [javac]   symbol:   class DuplicateFolderNameException
          [javac]   location: class DocumentumRepository
          [javac] Note: /opt/dev/projects/github/liferay-plugins-ee-7.0.x/hooks/documentum-hook/docroot/WEB-INF/src/com/liferay/documentum/repository/DocumentumRepository.java uses unchecked or unsafe operations.
          [javac] Note: Recompile with -Xlint:unchecked for details.
          [javac] 18 errors
      
      BUILD FAILED
      /opt/dev/projects/github/liferay-plugins-ee-7.0.x/build-common-plugin.xml:421: The following error occurred while executing this line:
      /opt/dev/projects/github/liferay-plugins-ee-7.0.x/build-common.xml:3406: The following error occurred while executing this line:
      : The following error occurred while executing this line:
      /opt/dev/projects/github/liferay-plugins-ee-7.0.x/build-common.xml:1468: The following error occurred while executing this line:
      : The following error occurred while executing this line:
      /opt/dev/projects/github/liferay-plugins-ee-7.0.x/build-common.xml:3041: The following error occurred while executing this line:
      /opt/dev/projects/github/liferay-plugins-ee-7.0.x/build-common.xml:3143: The following error occurred while executing this line:
      : The following error occurred while executing this line:
      /opt/dev/projects/github/liferay-plugins-ee-7.0.x/build-common.xml:677: The following error occurred while executing this line:
      /opt/dev/projects/github/liferay-plugins-ee-7.0.x/build-common.xml:1112: The following error occurred while executing this line:
      /opt/dev/projects/github/liferay-plugins-ee-7.0.x/build-common.xml:985: Compile failed; see the compiler error output for details.
      
      Total time: 5 seconds
      [/opt/dev/projects/github/liferay-plugins-ee-7.0.x/hooks/documentum-hook] (ee-7.0.x)
      sharon$ ant all
      Buildfile: /opt/dev/projects/github/liferay-plugins-ee-7.0.x/hooks/documentum-hook/build.xml
      
      all:
      
      clean:
         [delete] Deleting directory /opt/dev/projects/github/liferay-plugins-ee-7.0.x/hooks/documentum-hook/docroot/WEB-INF/classes
      
      deploy:
          [mkdir] Created dir: /opt/dev/projects/github/liferay-plugins-ee-7.0.x/hooks/documentum-hook/docroot/WEB-INF/classes
           [copy] Copying 3 files to /opt/dev/projects/github/liferay-plugins-ee-7.0.x/hooks/documentum-hook/docroot/WEB-INF/lib
           [copy] Copying 5 files to /opt/dev/projects/github/liferay-plugins-ee-7.0.x/hooks/documentum-hook/docroot/WEB-INF/lib
           [copy] Copying 5 files to /opt/dev/projects/github/liferay-plugins-ee-7.0.x/hooks/documentum-hook/docroot/WEB-INF/classes
           [copy] Copied 8 empty directories to 6 empty directories under /opt/dev/projects/github/liferay-plugins-ee-7.0.x/hooks/documentum-hook/docroot/WEB-INF/classes
          [javac] Compiling 22 source files to /opt/dev/projects/github/liferay-plugins-ee-7.0.x/hooks/documentum-hook/docroot/WEB-INF/classes
          [javac] /opt/dev/projects/github/liferay-plugins-ee-7.0.x/hooks/documentum-hook/docroot/WEB-INF/src/com/liferay/documentum/repository/DocumentumRepository.java:43: error: cannot find symbol
          [javac] import com.liferay.portal.InvalidRepositoryException;
          [javac]                          ^
          [javac]   symbol:   class InvalidRepositoryException
          [javac]   location: package com.liferay.portal
          [javac] /opt/dev/projects/github/liferay-plugins-ee-7.0.x/hooks/documentum-hook/docroot/WEB-INF/src/com/liferay/documentum/repository/DocumentumRepository.java:62: error: cannot find symbol
          [javac] import com.liferay.portlet.documentlibrary.DuplicateFileException;
          [javac]                                           ^
          [javac]   symbol:   class DuplicateFileException
          [javac]   location: package com.liferay.portlet.documentlibrary
          [javac] /opt/dev/projects/github/liferay-plugins-ee-7.0.x/hooks/documentum-hook/docroot/WEB-INF/src/com/liferay/documentum/repository/DocumentumRepository.java:63: error: cannot find symbol
          [javac] import com.liferay.portlet.documentlibrary.DuplicateFolderNameException;
          [javac]                                           ^
          [javac]   symbol:   class DuplicateFolderNameException
          [javac]   location: package com.liferay.portlet.documentlibrary
          [javac] /opt/dev/projects/github/liferay-plugins-ee-7.0.x/hooks/documentum-hook/docroot/WEB-INF/src/com/liferay/documentum/repository/DocumentumRepository.java:64: error: cannot find symbol
          [javac] import com.liferay.portlet.documentlibrary.FileExtensionException;
          [javac]                                           ^
          [javac]   symbol:   class FileExtensionException
          [javac]   location: package com.liferay.portlet.documentlibrary
          [javac] /opt/dev/projects/github/liferay-plugins-ee-7.0.x/hooks/documentum-hook/docroot/WEB-INF/src/com/liferay/documentum/repository/DocumentumRepository.java:65: error: cannot find symbol
          [javac] import com.liferay.portlet.documentlibrary.NoSuchFileEntryException;
          [javac]                                           ^
          [javac]   symbol:   class NoSuchFileEntryException
          [javac]   location: package com.liferay.portlet.documentlibrary
          [javac] /opt/dev/projects/github/liferay-plugins-ee-7.0.x/hooks/documentum-hook/docroot/WEB-INF/src/com/liferay/documentum/repository/DocumentumRepository.java:66: error: cannot find symbol
          [javac] import com.liferay.portlet.documentlibrary.NoSuchFileVersionException;
          [javac]                                           ^
          [javac]   symbol:   class NoSuchFileVersionException
          [javac]   location: package com.liferay.portlet.documentlibrary
          [javac] /opt/dev/projects/github/liferay-plugins-ee-7.0.x/hooks/documentum-hook/docroot/WEB-INF/src/com/liferay/documentum/repository/DocumentumRepository.java:67: error: cannot find symbol
          [javac] import com.liferay.portlet.documentlibrary.NoSuchFolderException;
          [javac]                                           ^
          [javac]   symbol:   class NoSuchFolderException
          [javac]   location: package com.liferay.portlet.documentlibrary
          [javac] /opt/dev/projects/github/liferay-plugins-ee-7.0.x/hooks/documentum-hook/docroot/WEB-INF/src/com/liferay/documentum/repository/DocumentumRepository.java:770: error: cannot find symbol
          [javac] 		throws InvalidRepositoryException, PrincipalException {
          [javac] 		       ^
          [javac]   symbol:   class InvalidRepositoryException
          [javac]   location: class DocumentumRepository
          [javac] /opt/dev/projects/github/liferay-plugins-ee-7.0.x/hooks/documentum-hook/docroot/WEB-INF/src/com/liferay/documentum/repository/DocumentumRepository.java:128: error: cannot find symbol
          [javac] 					throw new FileExtensionException(
          [javac] 					          ^
          [javac]   symbol: class FileExtensionException
          [javac] /opt/dev/projects/github/liferay-plugins-ee-7.0.x/hooks/documentum-hook/docroot/WEB-INF/src/com/liferay/documentum/repository/DocumentumRepository.java:505: error: cannot find symbol
          [javac] 					throw new NoSuchFileVersionException(version);
          [javac] 					          ^
          [javac]   symbol: class NoSuchFileVersionException
          [javac] /opt/dev/projects/github/liferay-plugins-ee-7.0.x/hooks/documentum-hook/docroot/WEB-INF/src/com/liferay/documentum/repository/DocumentumRepository.java:589: error: cannot find symbol
          [javac] 						throw new NoSuchFolderException(extRepositoryObjectKey);
          [javac] 						          ^
          [javac]   symbol: class NoSuchFolderException
          [javac] /opt/dev/projects/github/liferay-plugins-ee-7.0.x/hooks/documentum-hook/docroot/WEB-INF/src/com/liferay/documentum/repository/DocumentumRepository.java:592: error: cannot find symbol
          [javac] 						throw new NoSuchFileEntryException(
          [javac] 						          ^
          [javac]   symbol: class NoSuchFileEntryException
          [javac] /opt/dev/projects/github/liferay-plugins-ee-7.0.x/hooks/documentum-hook/docroot/WEB-INF/src/com/liferay/documentum/repository/DocumentumRepository.java:632: error: cannot find symbol
          [javac] 					throw new NoSuchFileEntryException(sb.toString());
          [javac] 					          ^
          [javac]   symbol: class NoSuchFileEntryException
          [javac] /opt/dev/projects/github/liferay-plugins-ee-7.0.x/hooks/documentum-hook/docroot/WEB-INF/src/com/liferay/documentum/repository/DocumentumRepository.java:775: error: cannot find symbol
          [javac] 			throw new InvalidRepositoryException();
          [javac] 			          ^
          [javac]   symbol:   class InvalidRepositoryException
          [javac]   location: class DocumentumRepository
          [javac] /opt/dev/projects/github/liferay-plugins-ee-7.0.x/hooks/documentum-hook/docroot/WEB-INF/src/com/liferay/documentum/repository/DocumentumRepository.java:781: error: cannot find symbol
          [javac] 			throw new InvalidRepositoryException();
          [javac] 			          ^
          [javac]   symbol:   class InvalidRepositoryException
          [javac]   location: class DocumentumRepository
          [javac] /opt/dev/projects/github/liferay-plugins-ee-7.0.x/hooks/documentum-hook/docroot/WEB-INF/src/com/liferay/documentum/repository/DocumentumRepository.java:1019: error: cannot find symbol
          [javac] 						throw new FileExtensionException(
          [javac] 						          ^
          [javac]   symbol: class FileExtensionException
          [javac] /opt/dev/projects/github/liferay-plugins-ee-7.0.x/hooks/documentum-hook/docroot/WEB-INF/src/com/liferay/documentum/repository/DocumentumRepository.java:1412: error: cannot find symbol
          [javac] 			throw new DuplicateFileException(title);
          [javac] 			          ^
          [javac]   symbol:   class DuplicateFileException
          [javac]   location: class DocumentumRepository
          [javac] /opt/dev/projects/github/liferay-plugins-ee-7.0.x/hooks/documentum-hook/docroot/WEB-INF/src/com/liferay/documentum/repository/DocumentumRepository.java:1420: error: cannot find symbol
          [javac] 			throw new DuplicateFolderNameException(title);
          [javac] 			          ^
          [javac]   symbol:   class DuplicateFolderNameException
          [javac]   location: class DocumentumRepository
          [javac] Note: /opt/dev/projects/github/liferay-plugins-ee-7.0.x/hooks/documentum-hook/docroot/WEB-INF/src/com/liferay/documentum/repository/DocumentumRepository.java uses unchecked or unsafe operations.
          [javac] Note: Recompile with -Xlint:unchecked for details.
          [javac] 18 errors
      
      BUILD FAILED
      /opt/dev/projects/github/liferay-plugins-ee-7.0.x/build-common-plugin.xml:421: The following error occurred while executing this line:
      /opt/dev/projects/github/liferay-plugins-ee-7.0.x/build-common.xml:3406: The following error occurred while executing this line:
      : The following error occurred while executing this line:
      /opt/dev/projects/github/liferay-plugins-ee-7.0.x/build-common.xml:1468: The following error occurred while executing this line:
      : The following error occurred while executing this line:
      /opt/dev/projects/github/liferay-plugins-ee-7.0.x/build-common.xml:3041: The following error occurred while executing this line:
      /opt/dev/projects/github/liferay-plugins-ee-7.0.x/build-common.xml:3143: The following error occurred while executing this line:
      : The following error occurred while executing this line:
      /opt/dev/projects/github/liferay-plugins-ee-7.0.x/build-common.xml:677: The following error occurred while executing this line:
      /opt/dev/projects/github/liferay-plugins-ee-7.0.x/build-common.xml:1112: The following error occurred while executing this line:
      /opt/dev/projects/github/liferay-plugins-ee-7.0.x/build-common.xml:985: Compile failed; see the compiler error output for details.
      
      Total time: 5 seconds
      
      [/opt/dev/projects/github/liferay-plugins-ee-7.0.x] (ee-7.0.x)
      sharon$ git log -n 1
      commit c18433ee5402b4372c5d3c89b7de843996c3c4a2
      Author: Brian Chan <brian.chan@liferay.com>
      Date:   Mon Jan 25 19:36:03 2016 -0800
      
          LPS-61420
      

        Attachments

          Activity

            People

            • Votes:
              0 Vote for this issue
              Watchers:
              0 Start watching this issue

              Dates

              • Created:
                Updated:
                Resolved:
                Days since last comment:
                3 years, 34 weeks, 3 days ago

                Packages

                Version Package
                7.0.0 Beta 5