Details

      Description

      Reproduced on:
      Tomcat 8.0.30 + MySQL 5.6.29. Portal ee-7.0.x GIT ID: ebaa71620dcbe33f4a9901c22a134cf2d0e5f0b6.

      Steps to Reproduce:

      1. ant all

      Expected Result:
      ee-7.0.x compiles.

      Actual Result:
      Compile fails at:

           [exec] BUILD FAILED
           [exec]
           [exec] Total time: 55.63 secs
           [exec]
           [exec] FAILURE: Build failed with an exception.
           [exec]
           [exec] * Where:
           [exec] Build file '/Users/vicnate5/Liferay/liferay-portal-ee-7.0.x/modules/apps/workflow/workflow-kaleo-designer-web/build.gradle' line: 15
           [exec]
           [exec] * What went wrong:
           [exec] A problem occurred evaluating project ':apps:workflow:workflow-kaleo-designer-web'.
           [exec] > Project with path ':apps:application-list:application-list-api' could not be found in project ':apps:workflow:workflow-kaleo-designer-web'.
           [exec]
           [exec] * Try:
           [exec] Run with --info or --debug option to get more log output.
           [exec]
           [exec] * Exception is:
           [exec] org.gradle.api.GradleScriptException: A problem occurred evaluating project ':apps:workflow:workflow-kaleo-designer-web'.
           [exec] 	at org.gradle.groovy.scripts.internal.DefaultScriptRunnerFactory$ScriptRunnerImpl.run(DefaultScriptRunnerFactory.java:93)
           [exec] 	at org.gradle.configuration.DefaultScriptPluginFactory$ScriptPluginImpl$1.run(DefaultScriptPluginFactory.java:148)
           [exec] 	at org.gradle.configuration.ProjectScriptTarget.addConfiguration(ProjectScriptTarget.java:72)
           [exec] 	at org.gradle.configuration.DefaultScriptPluginFactory$ScriptPluginImpl.apply(DefaultScriptPluginFactory.java:153)
           [exec] 	at org.gradle.configuration.project.BuildScriptProcessor.execute(BuildScriptProcessor.java:38)
           [exec] 	at org.gradle.configuration.project.BuildScriptProcessor.execute(BuildScriptProcessor.java:25)
           [exec] 	at org.gradle.configuration.project.ConfigureActionsProjectEvaluator.evaluate(ConfigureActionsProjectEvaluator.java:34)
           [exec] 	at org.gradle.configuration.project.LifecycleProjectEvaluator.evaluate(LifecycleProjectEvaluator.java:55)
           [exec] 	at org.gradle.api.internal.project.AbstractProject.evaluate(AbstractProject.java:499)
           [exec] 	at org.gradle.api.internal.project.AbstractProject.evaluate(AbstractProject.java:86)
           [exec] 	at org.gradle.execution.TaskPathProjectEvaluator.configureHierarchy(TaskPathProjectEvaluator.java:47)
           [exec] 	at org.gradle.execution.TaskSelector.getSelection(TaskSelector.java:84)
           [exec] 	at org.gradle.execution.TaskSelector.getSelection(TaskSelector.java:75)
           [exec] 	at org.gradle.execution.commandline.CommandLineTaskParser.parseTasks(CommandLineTaskParser.java:42)
           [exec] 	at org.gradle.execution.TaskNameResolvingBuildConfigurationAction.configure(TaskNameResolvingBuildConfigurationAction.java:44)
           [exec] 	at org.gradle.execution.DefaultBuildConfigurationActionExecuter.configure(DefaultBuildConfigurationActionExecuter.java:48)
           [exec] 	at org.gradle.execution.DefaultBuildConfigurationActionExecuter.access$000(DefaultBuildConfigurationActionExecuter.java:25)
           [exec] 	at org.gradle.execution.DefaultBuildConfigurationActionExecuter$1.proceed(DefaultBuildConfigurationActionExecuter.java:54)
           [exec] 	at org.gradle.execution.DefaultTasksBuildExecutionAction.configure(DefaultTasksBuildExecutionAction.java:44)
           [exec] 	at org.gradle.execution.DefaultBuildConfigurationActionExecuter.configure(DefaultBuildConfigurationActionExecuter.java:48)
           [exec] 	at org.gradle.execution.DefaultBuildConfigurationActionExecuter.access$000(DefaultBuildConfigurationActionExecuter.java:25)
           [exec] 	at org.gradle.execution.DefaultBuildConfigurationActionExecuter$1.proceed(DefaultBuildConfigurationActionExecuter.java:54)
           [exec] 	at org.gradle.execution.ExcludedTaskFilteringBuildConfigurationAction.configure(ExcludedTaskFilteringBuildConfigurationAction.java:47)
           [exec] 	at org.gradle.execution.DefaultBuildConfigurationActionExecuter.configure(DefaultBuildConfigurationActionExecuter.java:48)
           [exec] 	at org.gradle.execution.DefaultBuildConfigurationActionExecuter.select(DefaultBuildConfigurationActionExecuter.java:36)
           [exec] 	at org.gradle.initialization.DefaultGradleLauncher$3.run(DefaultGradleLauncher.java:143)
           [exec] 	at org.gradle.internal.Factories$1.create(Factories.java:22)
           [exec] 	at org.gradle.internal.progress.DefaultBuildOperationExecutor.run(DefaultBuildOperationExecutor.java:90)
           [exec] 	at org.gradle.internal.progress.DefaultBuildOperationExecutor.run(DefaultBuildOperationExecutor.java:52)
           [exec] 	at org.gradle.initialization.DefaultGradleLauncher.doBuildStages(DefaultGradleLauncher.java:140)
           [exec] 	at org.gradle.initialization.DefaultGradleLauncher.access$200(DefaultGradleLauncher.java:32)
           [exec] 	at org.gradle.initialization.DefaultGradleLauncher$1.create(DefaultGradleLauncher.java:99)
           [exec] 	at org.gradle.initialization.DefaultGradleLauncher$1.create(DefaultGradleLauncher.java:93)
           [exec] 	at org.gradle.internal.progress.DefaultBuildOperationExecutor.run(DefaultBuildOperationExecutor.java:90)
           [exec] 	at org.gradle.internal.progress.DefaultBuildOperationExecutor.run(DefaultBuildOperationExecutor.java:62)
           [exec] 	at org.gradle.initialization.DefaultGradleLauncher.doBuild(DefaultGradleLauncher.java:93)
           [exec] 	at org.gradle.initialization.DefaultGradleLauncher.run(DefaultGradleLauncher.java:82)
           [exec] 	at org.gradle.launcher.exec.InProcessBuildActionExecuter$DefaultBuildController.run(InProcessBuildActionExecuter.java:94)
           [exec] 	at org.gradle.tooling.internal.provider.ExecuteBuildActionRunner.run(ExecuteBuildActionRunner.java:28)
           [exec] 	at org.gradle.launcher.exec.ChainingBuildActionRunner.run(ChainingBuildActionRunner.java:35)
           [exec] 	at org.gradle.launcher.exec.InProcessBuildActionExecuter.execute(InProcessBuildActionExecuter.java:43)
           [exec] 	at org.gradle.launcher.exec.InProcessBuildActionExecuter.execute(InProcessBuildActionExecuter.java:28)
           [exec] 	at org.gradle.launcher.exec.ContinuousBuildActionExecuter.execute(ContinuousBuildActionExecuter.java:77)
           [exec] 	at org.gradle.launcher.exec.ContinuousBuildActionExecuter.execute(ContinuousBuildActionExecuter.java:47)
           [exec] 	at org.gradle.launcher.exec.DaemonUsageSuggestingBuildActionExecuter.execute(DaemonUsageSuggestingBuildActionExecuter.java:51)
           [exec] 	at org.gradle.launcher.exec.DaemonUsageSuggestingBuildActionExecuter.execute(DaemonUsageSuggestingBuildActionExecuter.java:28)
           [exec] 	at org.gradle.launcher.cli.RunBuildAction.run(RunBuildAction.java:43)
           [exec] 	at org.gradle.internal.Actions$RunnableActionAdapter.execute(Actions.java:170)
           [exec] 	at org.gradle.launcher.cli.CommandLineActionFactory$ParseAndBuildAction.execute(CommandLineActionFactory.java:237)
           [exec] 	at org.gradle.launcher.cli.CommandLineActionFactory$ParseAndBuildAction.execute(CommandLineActionFactory.java:210)
           [exec] 	at org.gradle.launcher.cli.JavaRuntimeValidationAction.execute(JavaRuntimeValidationAction.java:35)
           [exec] 	at org.gradle.launcher.cli.JavaRuntimeValidationAction.execute(JavaRuntimeValidationAction.java:24)
           [exec] 	at org.gradle.launcher.cli.CommandLineActionFactory$WithLogging.execute(CommandLineActionFactory.java:206)
           [exec] 	at org.gradle.launcher.cli.CommandLineActionFactory$WithLogging.execute(CommandLineActionFactory.java:169)
           [exec] 	at org.gradle.launcher.cli.ExceptionReportingAction.execute(ExceptionReportingAction.java:33)
           [exec] 	at org.gradle.launcher.cli.ExceptionReportingAction.execute(ExceptionReportingAction.java:22)
           [exec] 	at org.gradle.launcher.Main.doAction(Main.java:33)
           [exec] 	at org.gradle.launcher.bootstrap.EntryPoint.run(EntryPoint.java:45)
           [exec] 	at org.gradle.launcher.bootstrap.ProcessBootstrap.runNoExit(ProcessBootstrap.java:54)
           [exec] 	at org.gradle.launcher.bootstrap.ProcessBootstrap.run(ProcessBootstrap.java:35)
           [exec] 	at org.gradle.launcher.GradleMain.main(GradleMain.java:23)
           [exec] 	at org.gradle.wrapper.BootstrapMainStarter.start(BootstrapMainStarter.java:30)
           [exec] 	at org.gradle.wrapper.WrapperExecutor.execute(WrapperExecutor.java:129)
           [exec] 	at org.gradle.wrapper.GradleWrapperMain.main(GradleWrapperMain.java:61)
           [exec] Caused by: org.gradle.api.UnknownProjectException: Project with path ':apps:application-list:application-list-api' could not be found in project ':apps:workflow:workflow-kaleo-designer-web'.
           [exec] 	at org.gradle.api.internal.project.AbstractProject.project(AbstractProject.java:445)
           [exec] 	at org.gradle.api.internal.BeanDynamicObject$MetaClassAdapter.invokeMethod(BeanDynamicObject.java:232)
           [exec] 	at org.gradle.api.internal.BeanDynamicObject.invokeMethod(BeanDynamicObject.java:127)
           [exec] 	at org.gradle.api.internal.CompositeDynamicObject.invokeMethod(CompositeDynamicObject.java:150)
           [exec] 	at org.gradle.groovy.scripts.BasicScript.methodMissing(BasicScript.java:79)
           [exec] 	at build_5xful779tnuzvg2aoglpfzyr2$_run_closure2.doCall(/Users/vicnate5/Liferay/liferay-portal-ee-7.0.x/modules/apps/workflow/workflow-kaleo-designer-web/build.gradle:15)
           [exec] 	at org.gradle.api.internal.ClosureBackedAction.execute(ClosureBackedAction.java:67)
           [exec] 	at org.gradle.util.ConfigureUtil.configure(ConfigureUtil.java:130)
           [exec] 	at org.gradle.util.ConfigureUtil.configure(ConfigureUtil.java:91)
           [exec] 	at org.gradle.api.internal.project.AbstractProject.dependencies(AbstractProject.java:854)
           [exec] 	at org.gradle.api.internal.BeanDynamicObject$MetaClassAdapter.invokeMethod(BeanDynamicObject.java:232)
           [exec] 	at org.gradle.api.internal.BeanDynamicObject.invokeMethod(BeanDynamicObject.java:127)
           [exec] 	at org.gradle.api.internal.CompositeDynamicObject.invokeMethod(CompositeDynamicObject.java:150)
           [exec] 	at org.gradle.groovy.scripts.BasicScript.methodMissing(BasicScript.java:79)
           [exec] 	at build_5xful779tnuzvg2aoglpfzyr2.run(/Users/vicnate5/Liferay/liferay-portal-ee-7.0.x/modules/apps/workflow/workflow-kaleo-designer-web/build.gradle:9)
           [exec] 	at org.gradle.groovy.scripts.internal.DefaultScriptRunnerFactory$ScriptRunnerImpl.run(DefaultScriptRunnerFactory.java:91)
           [exec] 	... 63 more
           [exec]
           [exec]
      
      BUILD FAILED
      /Users/vicnate5/Liferay/liferay-portal-ee-7.0.x/build.xml:67: The following error occurred while executing this line:
      /Users/vicnate5/Liferay/liferay-portal-ee-7.0.x/build.xml:96: The following error occurred while executing this line:
      /Users/vicnate5/Liferay/liferay-portal-ee-7.0.x/build-common.xml:875: exec returned: 1
      

        Attachments

          Issue Links

            Activity

              People

              • Votes:
                0 Vote for this issue
                Watchers:
                0 Start watching this issue

                Dates

                • Created:
                  Updated:
                  Resolved:
                  Days since last comment:
                  3 years, 21 weeks ago

                  Packages

                  Version Package
                  7.0.0 Beta 8