Details

    • Fix Priority:
      5

      Description

      Reproduced on:
      Tomcat 8.0.30 + MySQL 5.6.29. Portal ee-7.0.x GIT ID: 319ad7f3fb4d6cea8d462accf15542927a809221.

      Steps to reproduce:

      1. ant all

      Expected Result:
      Portal compiles without issue.

      Actual Result:
      ee-7.0.x fails to compile with output:

           [exec] FAILURE: Build failed with an exception.
           [exec]
           [exec]
           [exec] BUILD FAILED
           [exec]
           [exec] Total time: 5 mins 35.491 secs
           [exec] * What went wrong:
           [exec] Execution failed for task ':ee:apps:business-productivity:portal-workflow:portal-workflow-kaleo-forms-web:compileJava'.
           [exec] > Compilation failed; see the compiler error output for details.
           [exec]
           [exec] * Try:
           [exec] Run with --info or --debug option to get more log output.
           [exec]
           [exec] * Exception is:
           [exec] org.gradle.api.tasks.TaskExecutionException: Execution failed for task ':ee:apps:business-productivity:portal-workflow:portal-workflow-kaleo-forms-web:compileJava'.
           [exec] 	at org.gradle.api.internal.tasks.execution.ExecuteActionsTaskExecuter.executeActions(ExecuteActionsTaskExecuter.java:69)
           [exec] 	at org.gradle.api.internal.tasks.execution.ExecuteActionsTaskExecuter.execute(ExecuteActionsTaskExecuter.java:46)
           [exec] 	at org.gradle.api.internal.tasks.execution.PostExecutionAnalysisTaskExecuter.execute(PostExecutionAnalysisTaskExecuter.java:35)
           [exec] 	at org.gradle.api.internal.tasks.execution.SkipUpToDateTaskExecuter.execute(SkipUpToDateTaskExecuter.java:64)
           [exec] 	at org.gradle.api.internal.tasks.execution.ValidatingTaskExecuter.execute(ValidatingTaskExecuter.java:58)
           [exec] 	at org.gradle.api.internal.tasks.execution.SkipEmptySourceFilesTaskExecuter.execute(SkipEmptySourceFilesTaskExecuter.java:52)
           [exec] 	at org.gradle.api.internal.tasks.execution.SkipTaskWithNoActionsExecuter.execute(SkipTaskWithNoActionsExecuter.java:52)
           [exec] 	at org.gradle.api.internal.tasks.execution.SkipOnlyIfTaskExecuter.execute(SkipOnlyIfTaskExecuter.java:53)
           [exec] 	at org.gradle.api.internal.tasks.execution.ExecuteAtMostOnceTaskExecuter.execute(ExecuteAtMostOnceTaskExecuter.java:43)
           [exec] 	at org.gradle.execution.taskgraph.DefaultTaskGraphExecuter$EventFiringTaskWorker.execute(DefaultTaskGraphExecuter.java:203)
           [exec] 	at org.gradle.execution.taskgraph.DefaultTaskGraphExecuter$EventFiringTaskWorker.execute(DefaultTaskGraphExecuter.java:185)
           [exec] 	at org.gradle.execution.taskgraph.AbstractTaskPlanExecutor$TaskExecutorWorker.processTask(AbstractTaskPlanExecutor.java:62)
           [exec] 	at org.gradle.execution.taskgraph.AbstractTaskPlanExecutor$TaskExecutorWorker.run(AbstractTaskPlanExecutor.java:50)
           [exec] 	at org.gradle.internal.concurrent.ExecutorPolicy$CatchAndRecordFailures.onExecute(ExecutorPolicy.java:54)
           [exec] 	at org.gradle.internal.concurrent.StoppableExecutorImpl$1.run(StoppableExecutorImpl.java:40)
           [exec] Caused by: org.gradle.api.internal.tasks.compile.CompilationFailedException: Compilation failed; see the compiler error output for details.
           [exec] 	at org.gradle.api.internal.tasks.compile.JdkJavaCompiler.execute(JdkJavaCompiler.java:47)
           [exec] 	at org.gradle.api.internal.tasks.compile.JdkJavaCompiler.execute(JdkJavaCompiler.java:33)
           [exec] 	at org.gradle.api.internal.tasks.compile.NormalizingJavaCompiler.delegateAndHandleErrors(NormalizingJavaCompiler.java:101)
           [exec] 	at org.gradle.api.internal.tasks.compile.NormalizingJavaCompiler.execute(NormalizingJavaCompiler.java:50)
           [exec] 	at org.gradle.api.internal.tasks.compile.NormalizingJavaCompiler.execute(NormalizingJavaCompiler.java:36)
           [exec] 	at org.gradle.api.internal.tasks.compile.CleaningJavaCompilerSupport.execute(CleaningJavaCompilerSupport.java:34)
           [exec] 	at org.gradle.api.internal.tasks.compile.CleaningJavaCompilerSupport.execute(CleaningJavaCompilerSupport.java:25)
           [exec] 	at org.gradle.api.tasks.compile.JavaCompile.performCompilation(JavaCompile.java:157)
           [exec] 	at org.gradle.api.tasks.compile.JavaCompile.compile(JavaCompile.java:139)
           [exec] 	at org.gradle.api.tasks.compile.JavaCompile.compile(JavaCompile.java:93)
           [exec] 	at org.gradle.internal.reflect.JavaMethod.invoke(JavaMethod.java:75)
           [exec] 	at org.gradle.api.internal.project.taskfactory.AnnotationProcessingTaskFactory$IncrementalTaskAction.doExecute(AnnotationProcessingTaskFactory.java:244)
           [exec] 	at org.gradle.api.internal.project.taskfactory.AnnotationProcessingTaskFactory$StandardTaskAction.execute(AnnotationProcessingTaskFactory.java:220)
           [exec] 	at org.gradle.api.internal.project.taskfactory.AnnotationProcessingTaskFactory$IncrementalTaskAction.execute(AnnotationProcessingTaskFactory.java:231)
           [exec] 	at org.gradle.api.internal.project.taskfactory.AnnotationProcessingTaskFactory$StandardTaskAction.execute(AnnotationProcessingTaskFactory.java:209)
           [exec] 	at org.gradle.api.internal.tasks.execution.ExecuteActionsTaskExecuter.executeAction(ExecuteActionsTaskExecuter.java:80)
           [exec] 	at org.gradle.api.internal.tasks.execution.ExecuteActionsTaskExecuter.executeActions(ExecuteActionsTaskExecuter.java:61)
           [exec] 	... 14 more
           [exec]
           [exec]
      
      BUILD FAILED
      /Users/vicnate5/Liferay/liferay-portal-ee-7.0.x/build.xml:69: The following error occurred while executing this line:
      /Users/vicnate5/Liferay/liferay-portal-ee-7.0.x/build.xml:363: The following error occurred while executing this line:
      /Users/vicnate5/Liferay/liferay-portal-ee-7.0.x/build-common.xml:875: exec returned: 1
      

        Attachments

          Issue Links

            Activity

              People

              • Assignee:
                victor.ware Victor Ware
                Reporter:
                victor.ware Victor Ware
                Participants of an Issue:
                Recent user:
                Esther Sanz
              • Votes:
                0 Vote for this issue
                Watchers:
                1 Start watching this issue

                Dates

                • Created:
                  Updated:
                  Resolved:
                  Days since last comment:
                  1 year, 41 weeks, 1 day ago