Details

    • Fix Priority:
      5

      Description

      Steps to reproduce:

      1. Deploy a module, e.g. vldap-web.

      Actual results:

      liferay-portal-ee (ee-7.0.x) $ gradle deploy --stacktrace
      Configuration on demand is an incubating feature.
      Defining custom 'clean' task when using the standard Gradle lifecycle plugins has been deprecated and is scheduled to be removed in Gradle 3.0
      
      FAILURE: Build failed with an exception.
      
      * Where:
      Build file '/shtn/git/liferay-portal-ee/modules/build.gradle' line: 40
      
      * What went wrong:
      A problem occurred configuring project ':apps:foundation:frontend-css:frontend-css-common'.
      > Failed to notify project evaluation listener.
         > org/gradle/api/java/archives/internal/ManifestInternal
      
      * Try:
      Run with --info or --debug option to get more log output.
      
      * Exception is:
      org.gradle.api.ProjectConfigurationException: A problem occurred configuring project ':apps:foundation:frontend-css:frontend-css-common'.
      	at org.gradle.configuration.project.LifecycleProjectEvaluator.addConfigurationFailure(LifecycleProjectEvaluator.java:79)
      	at org.gradle.configuration.project.LifecycleProjectEvaluator.evaluate(LifecycleProjectEvaluator.java:49)
      	at org.gradle.api.internal.project.AbstractProject.evaluate(AbstractProject.java:510)
      	at org.gradle.api.internal.project.AbstractProject.evaluate(AbstractProject.java:90)
      	at org.gradle.api.internal.project.DefaultProjectAccessListener.evaluateProjectAndDiscoverTasks(DefaultProjectAccessListener.java:32)
      	at org.gradle.api.internal.project.DefaultProjectAccessListener.beforeRequestingTaskByPath(DefaultProjectAccessListener.java:24)
      	at org.gradle.api.internal.tasks.DefaultTaskContainer.findByPath(DefaultTaskContainer.java:149)
      	at org.gradle.api.internal.tasks.DefaultTaskContainer.getByPath(DefaultTaskContainer.java:162)
      	at org.gradle.api.internal.tasks.DefaultTaskContainer.resolveTask(DefaultTaskContainer.java:158)
      	at org.gradle.api.internal.tasks.DefaultTaskDependency.visitDependencies(DefaultTaskDependency.java:85)
      	at org.gradle.api.internal.tasks.CachingTaskDependencyResolveContext$TaskGraphImpl.getNodeValues(CachingTaskDependencyResolveContext.java:88)
      	at org.gradle.internal.graph.CachingDirectedGraphWalker$GraphWithEmpyEdges.getNodeValues(CachingDirectedGraphWalker.java:202)
      	at org.gradle.internal.graph.CachingDirectedGraphWalker.doSearch(CachingDirectedGraphWalker.java:112)
      	at org.gradle.internal.graph.CachingDirectedGraphWalker.findValues(CachingDirectedGraphWalker.java:64)
      	at org.gradle.api.internal.tasks.CachingTaskDependencyResolveContext.doResolve(CachingTaskDependencyResolveContext.java:76)
      	at org.gradle.api.internal.tasks.CachingTaskDependencyResolveContext.resolve(CachingTaskDependencyResolveContext.java:65)
      	at org.gradle.api.internal.tasks.CachingTaskDependencyResolveContext.getDependencies(CachingTaskDependencyResolveContext.java:55)
      	at org.gradle.execution.taskgraph.DefaultTaskExecutionPlan.addToTaskGraph(DefaultTaskExecutionPlan.java:139)
      	at org.gradle.execution.taskgraph.DefaultTaskGraphExecuter.addTasks(DefaultTaskGraphExecuter.java:98)
      	at org.gradle.execution.TaskNameResolvingBuildConfigurationAction.configure(TaskNameResolvingBuildConfigurationAction.java:47)
      	at org.gradle.execution.DefaultBuildConfigurationActionExecuter.configure(DefaultBuildConfigurationActionExecuter.java:48)
      	at org.gradle.execution.DefaultBuildConfigurationActionExecuter.access$000(DefaultBuildConfigurationActionExecuter.java:25)
      	at org.gradle.execution.DefaultBuildConfigurationActionExecuter$1.proceed(DefaultBuildConfigurationActionExecuter.java:54)
      	at org.gradle.execution.DefaultTasksBuildExecutionAction.configure(DefaultTasksBuildExecutionAction.java:44)
      	at org.gradle.execution.DefaultBuildConfigurationActionExecuter.configure(DefaultBuildConfigurationActionExecuter.java:48)
      	at org.gradle.execution.DefaultBuildConfigurationActionExecuter.access$000(DefaultBuildConfigurationActionExecuter.java:25)
      	at org.gradle.execution.DefaultBuildConfigurationActionExecuter$1.proceed(DefaultBuildConfigurationActionExecuter.java:54)
      	at org.gradle.execution.ExcludedTaskFilteringBuildConfigurationAction.configure(ExcludedTaskFilteringBuildConfigurationAction.java:47)
      	at org.gradle.execution.DefaultBuildConfigurationActionExecuter.configure(DefaultBuildConfigurationActionExecuter.java:48)
      	at org.gradle.execution.DefaultBuildConfigurationActionExecuter.select(DefaultBuildConfigurationActionExecuter.java:36)
      	at org.gradle.initialization.DefaultGradleLauncher$3.run(DefaultGradleLauncher.java:143)
      	at org.gradle.internal.Factories$1.create(Factories.java:22)
      	at org.gradle.internal.progress.DefaultBuildOperationExecutor.run(DefaultBuildOperationExecutor.java:90)
      	at org.gradle.internal.progress.DefaultBuildOperationExecutor.run(DefaultBuildOperationExecutor.java:52)
      	at org.gradle.initialization.DefaultGradleLauncher.doBuildStages(DefaultGradleLauncher.java:140)
      	at org.gradle.initialization.DefaultGradleLauncher.access$200(DefaultGradleLauncher.java:32)
      	at org.gradle.initialization.DefaultGradleLauncher$1.create(DefaultGradleLauncher.java:99)
      	at org.gradle.initialization.DefaultGradleLauncher$1.create(DefaultGradleLauncher.java:93)
      	at org.gradle.internal.progress.DefaultBuildOperationExecutor.run(DefaultBuildOperationExecutor.java:90)
      	at org.gradle.internal.progress.DefaultBuildOperationExecutor.run(DefaultBuildOperationExecutor.java:62)
      	at org.gradle.initialization.DefaultGradleLauncher.doBuild(DefaultGradleLauncher.java:93)
      	at org.gradle.initialization.DefaultGradleLauncher.run(DefaultGradleLauncher.java:82)
      	at org.gradle.launcher.exec.InProcessBuildActionExecuter$DefaultBuildController.run(InProcessBuildActionExecuter.java:94)
      	at org.gradle.tooling.internal.provider.ExecuteBuildActionRunner.run(ExecuteBuildActionRunner.java:28)
      	at org.gradle.launcher.exec.ChainingBuildActionRunner.run(ChainingBuildActionRunner.java:35)
      	at org.gradle.launcher.exec.InProcessBuildActionExecuter.execute(InProcessBuildActionExecuter.java:43)
      	at org.gradle.launcher.exec.InProcessBuildActionExecuter.execute(InProcessBuildActionExecuter.java:28)
      	at org.gradle.launcher.exec.ContinuousBuildActionExecuter.execute(ContinuousBuildActionExecuter.java:78)
      	at org.gradle.launcher.exec.ContinuousBuildActionExecuter.execute(ContinuousBuildActionExecuter.java:48)
      	at org.gradle.launcher.exec.DaemonUsageSuggestingBuildActionExecuter.execute(DaemonUsageSuggestingBuildActionExecuter.java:51)
      	at org.gradle.launcher.exec.DaemonUsageSuggestingBuildActionExecuter.execute(DaemonUsageSuggestingBuildActionExecuter.java:28)
      	at org.gradle.launcher.cli.RunBuildAction.run(RunBuildAction.java:43)
      	at org.gradle.internal.Actions$RunnableActionAdapter.execute(Actions.java:170)
      	at org.gradle.launcher.cli.CommandLineActionFactory$ParseAndBuildAction.execute(CommandLineActionFactory.java:237)
      	at org.gradle.launcher.cli.CommandLineActionFactory$ParseAndBuildAction.execute(CommandLineActionFactory.java:210)
      	at org.gradle.launcher.cli.JavaRuntimeValidationAction.execute(JavaRuntimeValidationAction.java:35)
      	at org.gradle.launcher.cli.JavaRuntimeValidationAction.execute(JavaRuntimeValidationAction.java:24)
      	at org.gradle.launcher.cli.CommandLineActionFactory$WithLogging.execute(CommandLineActionFactory.java:206)
      	at org.gradle.launcher.cli.CommandLineActionFactory$WithLogging.execute(CommandLineActionFactory.java:169)
      	at org.gradle.launcher.cli.ExceptionReportingAction.execute(ExceptionReportingAction.java:33)
      	at org.gradle.launcher.cli.ExceptionReportingAction.execute(ExceptionReportingAction.java:22)
      	at org.gradle.launcher.Main.doAction(Main.java:33)
      	at org.gradle.launcher.bootstrap.EntryPoint.run(EntryPoint.java:45)
      	at org.gradle.launcher.bootstrap.ProcessBootstrap.runNoExit(ProcessBootstrap.java:54)
      	at org.gradle.launcher.bootstrap.ProcessBootstrap.run(ProcessBootstrap.java:35)
      	at org.gradle.launcher.GradleMain.main(GradleMain.java:23)
      Caused by: org.gradle.internal.event.ListenerNotificationException: Failed to notify project evaluation listener.
      	at org.gradle.internal.event.AbstractBroadcastDispatch.dispatch(AbstractBroadcastDispatch.java:55)
      	at org.gradle.internal.event.BroadcastDispatch.dispatch(BroadcastDispatch.java:79)
      	at org.gradle.internal.event.BroadcastDispatch.dispatch(BroadcastDispatch.java:30)
      	at org.gradle.messaging.dispatch.ProxyDispatchAdapter$DispatchingInvocationHandler.invoke(ProxyDispatchAdapter.java:93)
      	at com.sun.proxy.$Proxy12.beforeEvaluate(Unknown Source)
      	at org.gradle.messaging.dispatch.ReflectionDispatch.dispatch(ReflectionDispatch.java:35)
      	at org.gradle.messaging.dispatch.ReflectionDispatch.dispatch(ReflectionDispatch.java:24)
      	at org.gradle.internal.event.AbstractBroadcastDispatch.dispatch(AbstractBroadcastDispatch.java:44)
      	at org.gradle.internal.event.BroadcastDispatch.dispatch(BroadcastDispatch.java:79)
      	at org.gradle.internal.event.BroadcastDispatch.dispatch(BroadcastDispatch.java:30)
      	at org.gradle.messaging.dispatch.ProxyDispatchAdapter$DispatchingInvocationHandler.invoke(ProxyDispatchAdapter.java:93)
      	at com.sun.proxy.$Proxy12.beforeEvaluate(Unknown Source)
      	at org.gradle.configuration.project.LifecycleProjectEvaluator.evaluate(LifecycleProjectEvaluator.java:47)
      	... 64 more
      Caused by: java.lang.NoClassDefFoundError: org/gradle/api/java/archives/internal/ManifestInternal
      	at org.dm.gradle.plugins.bundle.BundlePlugin$_apply_closure2$_closure3.doCall(BundlePlugin.groovy:34)
      	at org.gradle.api.internal.ClosureBackedAction.execute(ClosureBackedAction.java:67)
      	at org.gradle.util.ConfigureUtil.configure(ConfigureUtil.java:130)
      	at org.gradle.util.ConfigureUtil.configure(ConfigureUtil.java:110)
      	at org.gradle.api.internal.AbstractTask.configure(AbstractTask.java:488)
      	at org.gradle.api.internal.AbstractTask.configure(AbstractTask.java:58)
      	at org.gradle.api.internal.ClosureBackedAction.execute(ClosureBackedAction.java:59)
      	at org.gradle.util.ConfigureUtil.configure(ConfigureUtil.java:130)
      	at org.gradle.util.ConfigureUtil.configure(ConfigureUtil.java:91)
      	at org.gradle.api.internal.DefaultNamedDomainObjectCollection$ContainerElementsDynamicObject.invokeMethod(DefaultNamedDomainObjectCollection.java:341)
      	at org.gradle.api.internal.CompositeDynamicObject.invokeMethod(CompositeDynamicObject.java:150)
      	at org.gradle.api.internal.project.DefaultProject_Decorated.invokeMethod(Unknown Source)
      	at org.dm.gradle.plugins.bundle.BundlePlugin$_apply_closure2.doCall(BundlePlugin.groovy:28)
      	at org.gradle.api.internal.ClosureBackedAction.execute(ClosureBackedAction.java:67)
      	at org.gradle.internal.Actions$FilteredAction.execute(Actions.java:202)
      	at org.gradle.listener.ActionBroadcast.execute(ActionBroadcast.java:39)
      	at org.gradle.api.internal.DefaultDomainObjectCollection.doAdd(DefaultDomainObjectCollection.java:165)
      	at org.gradle.api.internal.DefaultDomainObjectCollection.add(DefaultDomainObjectCollection.java:159)
      	at org.gradle.api.internal.plugins.DefaultPluginManager.doApply(DefaultPluginManager.java:149)
      	at org.gradle.api.internal.plugins.DefaultPluginManager.apply(DefaultPluginManager.java:116)
      	at org.gradle.api.internal.plugins.DefaultObjectConfigurationAction.applyType(DefaultObjectConfigurationAction.java:122)
      	at org.gradle.api.internal.plugins.DefaultObjectConfigurationAction.applyPlugin(DefaultObjectConfigurationAction.java:106)
      	at org.gradle.api.internal.plugins.DefaultObjectConfigurationAction.access$100(DefaultObjectConfigurationAction.java:35)
      	at org.gradle.api.internal.plugins.DefaultObjectConfigurationAction$2.run(DefaultObjectConfigurationAction.java:70)
      	at org.gradle.api.internal.plugins.DefaultObjectConfigurationAction.execute(DefaultObjectConfigurationAction.java:135)
      	at org.gradle.api.internal.project.AbstractPluginAware.apply(AbstractPluginAware.java:46)
      	at com.liferay.gradle.util.GradleUtil.applyPlugin(GradleUtil.java:153)
      	at com.liferay.gradle.plugins.LiferayOSGiPlugin.applyPlugins(LiferayOSGiPlugin.java:558)
      	at com.liferay.gradle.plugins.LiferayOSGiPlugin.apply(LiferayOSGiPlugin.java:121)
      	at com.liferay.gradle.plugins.LiferayOSGiPlugin.apply(LiferayOSGiPlugin.java:103)
      	at org.gradle.api.internal.plugins.ImperativeOnlyPluginApplicator.applyImperative(ImperativeOnlyPluginApplicator.java:35)
      	at org.gradle.api.internal.plugins.RuleBasedPluginApplicator.applyImperative(RuleBasedPluginApplicator.java:44)
      	at org.gradle.api.internal.plugins.DefaultPluginManager.doApply(DefaultPluginManager.java:144)
      	at org.gradle.api.internal.plugins.DefaultPluginManager.apply(DefaultPluginManager.java:116)
      	at org.gradle.api.internal.plugins.DefaultObjectConfigurationAction.applyType(DefaultObjectConfigurationAction.java:122)
      	at org.gradle.api.internal.plugins.DefaultObjectConfigurationAction.applyPlugin(DefaultObjectConfigurationAction.java:106)
      	at org.gradle.api.internal.plugins.DefaultObjectConfigurationAction.access$100(DefaultObjectConfigurationAction.java:35)
      	at org.gradle.api.internal.plugins.DefaultObjectConfigurationAction$2.run(DefaultObjectConfigurationAction.java:70)
      	at org.gradle.api.internal.plugins.DefaultObjectConfigurationAction.execute(DefaultObjectConfigurationAction.java:135)
      	at org.gradle.api.internal.project.AbstractPluginAware.apply(AbstractPluginAware.java:46)
      	at com.liferay.gradle.util.GradleUtil.applyPlugin(GradleUtil.java:153)
      	at com.liferay.gradle.plugins.LiferayOSGiDefaultsPlugin.apply(LiferayOSGiDefaultsPlugin.java:187)
      	at com.liferay.gradle.plugins.LiferayOSGiDefaultsPlugin.apply(LiferayOSGiDefaultsPlugin.java:153)
      	at org.gradle.api.internal.plugins.ImperativeOnlyPluginApplicator.applyImperative(ImperativeOnlyPluginApplicator.java:35)
      	at org.gradle.api.internal.plugins.RuleBasedPluginApplicator.applyImperative(RuleBasedPluginApplicator.java:44)
      	at org.gradle.api.internal.plugins.DefaultPluginManager.doApply(DefaultPluginManager.java:144)
      	at org.gradle.api.internal.plugins.DefaultPluginManager.apply(DefaultPluginManager.java:116)
      	at org.gradle.api.internal.plugins.DefaultObjectConfigurationAction.applyType(DefaultObjectConfigurationAction.java:122)
      	at org.gradle.api.internal.plugins.DefaultObjectConfigurationAction.applyPlugin(DefaultObjectConfigurationAction.java:106)
      	at org.gradle.api.internal.plugins.DefaultObjectConfigurationAction.access$100(DefaultObjectConfigurationAction.java:35)
      	at org.gradle.api.internal.plugins.DefaultObjectConfigurationAction$2.run(DefaultObjectConfigurationAction.java:70)
      	at org.gradle.api.internal.plugins.DefaultObjectConfigurationAction.execute(DefaultObjectConfigurationAction.java:135)
      	at org.gradle.api.internal.project.AbstractPluginAware.apply(AbstractPluginAware.java:46)
      	at com.liferay.gradle.util.GradleUtil.applyPlugin(GradleUtil.java:153)
      	at com.liferay.gradle.plugins.LiferayPlugin.apply(LiferayPlugin.java:54)
      	at com.liferay.gradle.plugins.LiferayDefaultsPlugin.apply(LiferayDefaultsPlugin.java:29)
      	at com.liferay.gradle.plugins.LiferayDefaultsPlugin.apply(LiferayDefaultsPlugin.java:25)
      	at org.gradle.api.internal.plugins.ImperativeOnlyPluginApplicator.applyImperative(ImperativeOnlyPluginApplicator.java:35)
      	at org.gradle.api.internal.plugins.RuleBasedPluginApplicator.applyImperative(RuleBasedPluginApplicator.java:44)
      	at org.gradle.api.internal.plugins.DefaultPluginManager.doApply(DefaultPluginManager.java:144)
      	at org.gradle.api.internal.plugins.DefaultPluginManager.apply(DefaultPluginManager.java:112)
      	at org.gradle.api.internal.plugins.DefaultObjectConfigurationAction.applyType(DefaultObjectConfigurationAction.java:112)
      	at org.gradle.api.internal.plugins.DefaultObjectConfigurationAction.access$200(DefaultObjectConfigurationAction.java:35)
      	at org.gradle.api.internal.plugins.DefaultObjectConfigurationAction$3.run(DefaultObjectConfigurationAction.java:79)
      	at org.gradle.api.internal.plugins.DefaultObjectConfigurationAction.execute(DefaultObjectConfigurationAction.java:135)
      	at org.gradle.api.internal.project.AbstractPluginAware.apply(AbstractPluginAware.java:46)
      	at build_1xryoie3dqyho3e6ei9e5igj3$_run_closure4$_closure9.doCall(/shtn/git/liferay-portal-ee/modules/build.gradle:40)
      	at org.gradle.api.internal.ClosureBackedAction.execute(ClosureBackedAction.java:67)
      	at org.gradle.util.ConfigureUtil.configure(ConfigureUtil.java:130)
      	at org.gradle.util.ConfigureUtil.configure(ConfigureUtil.java:91)
      	at org.gradle.api.internal.project.AbstractProject.configure(AbstractProject.java:846)
      	at org.gradle.api.internal.BeanDynamicObject$MetaClassAdapter.invokeMethod(BeanDynamicObject.java:236)
      	at org.gradle.api.internal.BeanDynamicObject.invokeMethod(BeanDynamicObject.java:130)
      	at org.gradle.api.internal.CompositeDynamicObject.invokeMethod(CompositeDynamicObject.java:150)
      	at org.gradle.groovy.scripts.BasicScript.methodMissing(BasicScript.java:79)
      	at build_1xryoie3dqyho3e6ei9e5igj3$_run_closure4.doCall(/shtn/git/liferay-portal-ee/modules/build.gradle:39)
      	at org.gradle.listener.ClosureBackedMethodInvocationDispatch.dispatch(ClosureBackedMethodInvocationDispatch.java:40)
      	at org.gradle.listener.ClosureBackedMethodInvocationDispatch.dispatch(ClosureBackedMethodInvocationDispatch.java:25)
      	at org.gradle.internal.event.AbstractBroadcastDispatch.dispatch(AbstractBroadcastDispatch.java:44)
      	... 76 more
      Caused by: java.lang.ClassNotFoundException: org.gradle.api.java.archives.internal.ManifestInternal
      	... 155 more
      
      
      BUILD FAILED
      
      Total time: 4.647 secs
      
      

      Expected results:
      No errors.

        Attachments

          Activity

            People

            • Votes:
              0 Vote for this issue
              Watchers:
              2 Start watching this issue

              Dates

              • Created:
                Updated:
                Resolved:
                Days since last comment:
                2 years, 42 weeks, 6 days ago