Uploaded image for project: 'PUBLIC - Liferay Portal Community Edition'
  1. PUBLIC - Liferay Portal Community Edition
  2. LPS-75964

Ignore KaleoDesignerXMLDefinitionSerializer test

    Details

    • Priority Level:
      Low

      Description

      KaleoDesignerXMLDefinitionSerializer is still failing after https://github.com/liferay/liferay-portal-ee/commit/c01325579d92cea2df8a7f539e804bd4a14b2504

      Chema suggested we skip the test for now, then add it back in once it's passing.

      Chema Balsas [9:48 AM]
      just wanted to let you know, that we should be able to ignore tests in two ways, prepending `x` to the test like `xit(...)`
      or appending `skip`
      like `describe.skip(...)` for a whole suite or `it.skip(...)` for individual tests
      http://mochajs.org/#inclusive-tests
      we should ignore the offending ones with one of those mechanisms to make sure no others are broken in between

      Example failure:
      https://test-1-12.liferay.com/job/test-portal-acceptance-pullrequest-batch(master)/119031/AXIS_VARIABLE=0,label_exp=!master/console

           [exec] :private:apps:forms-and-workflow:portal-workflow:portal-workflow-kaleo-designer-web:npmRunTest
           [exec] > portal-workflow-kaleo-designer-web@2.0.0 test /opt/dev/projects/github/liferay-portal/modules/private/apps/forms-and-workflow/portal-workflow/portal-workflow-kaleo-designer-web
           [exec] > karma start
           [exec] 
           [exec] 15 11 2017 21:27:12.868:WARN [karma]: No captured browser, open http://localhost:9876/
           [exec] 15 11 2017 21:27:12.906:INFO [karma]: Karma v1.7.1 server started at http://0.0.0.0:9876/
           [exec] 15 11 2017 21:27:12.907:INFO [launcher]: Launching browser Firefox with unlimited concurrency
           [exec] 15 11 2017 21:27:12.941:INFO [launcher]: Starting browser Firefox
           [exec] 15 11 2017 21:27:15.119:INFO [Firefox 38.0.0 (Linux 0.0.0)]: Connected on socket AuA8D0vyrS8RrtBuAAAA with id 13855920
           [exec] Firefox 38.0.0 (Linux 0.0.0): Executed 0 of 5 SUCCESS (0 secs / 0 secs)
           [exec] WARN: 'yui: NOT loaded: liferay-xml-formatter'
           [exec] Firefox 38.0.0 (Linux 0.0.0): Executed 0 of 5 SUCCESS (0 secs / 0 secs)
           [exec] WARN: 'yui: NOT loaded: liferay-xml-formatter'
           [exec] Firefox 38.0.0 (Linux 0.0.0): Executed 0 of 5 SUCCESS (0 secs / 0 secs)
           [exec] WARN: 'yui: NOT loaded: liferay-xml-formatter'
           [exec] Firefox 38.0.0 (Linux 0.0.0): Executed 0 of 5 SUCCESS (0 secs / 0 secs)
           [exec] Firefox 38.0.0 (Linux 0.0.0): Executed 1 of 5 SUCCESS (0 secs / 0.002 secs)
           [exec] Firefox 38.0.0 (Linux 0.0.0): Executed 2 of 5 SUCCESS (0 secs / 0.003 secs)
           [exec] Firefox 38.0.0 (Linux 0.0.0): Executed 3 of 5 SUCCESS (0 secs / 0.016 secs)
           [exec] Firefox 38.0.0 (Linux 0.0.0): Executed 4 of 5 SUCCESS (0 secs / 0.024 secs)
           [exec] Firefox 38.0.0 (Linux 0.0.0): Executed 5 of 5 SUCCESS (0 secs / 0.032 secs)
           [exec] Firefox 38.0.0 (Linux 0.0.0): Executed 5 of 5 SUCCESS (0.172 secs / 0.032 secs)
      [liferay-jenkins-ee] $ /bin/bash -e -x /tmp/hudson735635154721102265.sh
      + echo 'Execute: build-test-portal-acceptance-pullrequest-batch.sh build-timeout-operations'
      Execute: build-test-portal-acceptance-pullrequest-batch.sh build-timeout-operations
      + commands/build-test-portal-acceptance-pullrequest-batch.sh build-timeout-operations

      Example failure (before):
      https://test-1-11.liferay.com/job/test-portal-acceptance-pullrequest-batch(master)/180177/AXIS_VARIABLE=0,label_exp=!master/console

      ...
           [exec] Firefox 38.0.0 (Linux 0.0.0): Executed 1 of 5 (1 FAILED) (0 secs / 0.001 secs)
           [exec] Firefox 38.0.0 (Linux 0.0.0) Liferay.KaleoDesignerXMLDefinitionSerializer regression should serialize <user> element if given. FAILED
           [exec] 	definition.includes is not a function
           [exec] 	window.__cjs_module__["/opt/dev/projects/github/liferay-portal/modules/private/apps/forms-and-workflow/portal-workflow/portal-workflow-kaleo-designer-web/src/test/testJS/xml_definition_serializer_test.js"]/</</<@src/test/testJS/xml_definition_serializer_test.js:72:11
           [exec] 	
           [exec] Firefox 38.0.0 (Linux 0.0.0): Executed 2 of 5 (2 FAILED) (0 secs / 0.001 secs)
           [exec] Firefox 38.0.0 (Linux 0.0.0): Executed 3 of 5 (2 FAILED) (0 secs / 0.021 secs)
           [exec] Firefox 38.0.0 (Linux 0.0.0): Executed 4 of 5 (2 FAILED) (0 secs / 0.037 secs)
           [exec] Firefox 38.0.0 (Linux 0.0.0): Executed 5 of 5 (2 FAILED) (0 secs / 0.047 secs)
           [exec] Firefox 38.0.0 (Linux 0.0.0): Executed 5 of 5 (2 FAILED) (0.249 secs / 0.047 secs)

        Attachments

          Activity

            People

            • Assignee:
              jason.pince Jason Pince
              Reporter:
              jason.pince Jason Pince
              Recent user:
              Lester Pi
              Participants of an Issue:
            • Votes:
              0 Vote for this issue
              Watchers:
              0 Start watching this issue

              Dates

              • Created:
                Updated:
                Resolved:

                Packages

                Version Package