Uploaded image for project: 'PUBLIC - Liferay Portal Community Edition'
  1. PUBLIC - Liferay Portal Community Edition
  2. LPS-79306

Compile failure when coffee-script 1.12.8 is used as dependency

    Details

    • Type: Bug
    • Status: Closed
    • Resolution: No Longer Reproducible
    • Affects Version/s: 7.0.X
    • Fix Version/s: Master
    • Component/s: Liferay Themes
    • Labels:
      None

      Description

      Steps to reproduce issue:

      1. Fetch latest 7.0.x (or 7.0.x-private)
      2. Compile

      Expected result: The 7.0.x (or 7.0.x-private) bundle is compiled successfully
      Actual result: The 7.0.x (or 7.0.x-private) bundle fails to compile successfully, and the following is thrown during compile:

      :apps:adaptive-media:adaptive-media-web:downloadLiferayModuleConfigGenerator SKIPPED
      :apps:adaptive-media:adaptive-media-web:configJSModules
      :apps:frontend-theme-1975-london:frontend-theme-1975-london:expandFrontendCSSCommon
      :apps:frontend-theme-1975-london:frontend-theme-1975-london:saveMergeLangDestinationDir
      :apps:frontend-theme-1975-london:frontend-theme-1975-london:mergeLang
      :apps:frontend-theme-1975-london:frontend-theme-1975-london:npmInstall
      :apps:adaptive-media:adaptive-media-web:copyLibs SKIPPED
      :apps:adaptive-media:adaptive-media-web:replaceSoyTranslation
      :apps:adaptive-media:adaptive-media-web:wrapSoyAlloyTemplate SKIPPED
      :apps:adaptive-media:adaptive-media-web:classes
      :apps:adaptive-media:adaptive-media-web:jar
      :apps:adaptive-media:adaptive-media-web:deploy
      Files of project ':apps:adaptive-media:adaptive-media-web' deployed to C:\opt\dev\projects\github\liferay-portal-7.0.x-private\bundles\osgi\modules
      :apps:adaptive-media:adaptive-media-web:deployDependencies UP-TO-DATE
      :apps:foundation:frontend-theme:frontend-theme-styled:compileJava UP-TO-DATE
      :apps:foundation:frontend-theme:frontend-theme-styled:buildCSS
      C:\Windows\TEMP\cssBuilderImport7124304466207907883
      Using native Sass compiler
      There are no files to compile
      :apps:foundation:frontend-theme:frontend-theme-styled:processResources
      :apps:foundation:frontend-theme:frontend-theme-styled:transpileJS SKIPPED
      :apps:foundation:frontend-theme:frontend-theme-styled:configJSModules SKIPPED
      :apps:foundation:frontend-theme:frontend-theme-styled:copyLibs SKIPPED
      :apps:foundation:frontend-theme:frontend-theme-styled:replaceSoyTranslation UP-TO-DATE
      :apps:foundation:frontend-theme:frontend-theme-styled:wrapSoyAlloyTemplate SKIPPED
      :apps:foundation:frontend-theme:frontend-theme-styled:classes
      :apps:foundation:frontend-theme:frontend-theme-unstyled:buildAlloyUITheme
      :apps:foundation:frontend-theme:frontend-theme-unstyled:buildLexicon
      :apps:foundation:frontend-theme:frontend-theme-unstyled:buildLexiconFonts
      :apps:foundation:frontend-theme:frontend-theme-unstyled:buildLexiconIcons
      :apps:foundation:frontend-theme:frontend-theme-unstyled:buildTheme
      :apps:foundation:frontend-theme:frontend-theme-unstyled:compileJava UP-TO-DATE
      :apps:foundation:frontend-theme:frontend-theme-unstyled:buildCSS
      C:\Windows\TEMP\cssBuilderImport1620921226825446937
      Using native Sass compiler
      There are no files to compile
      :apps:foundation:frontend-theme:frontend-theme-unstyled:processResources
      :apps:foundation:frontend-theme:frontend-theme-unstyled:transpileJS SKIPPED
      :apps:foundation:frontend-theme:frontend-theme-unstyled:configJSModules SKIPPED
      :apps:foundation:frontend-theme:frontend-theme-unstyled:copyLibs SKIPPED
      :apps:foundation:frontend-theme:frontend-theme-unstyled:replaceSoyTranslation UP-TO-DATE
      :apps:foundation:frontend-theme:frontend-theme-unstyled:wrapSoyAlloyTemplate SKIPPED
      :apps:foundation:frontend-theme:frontend-theme-unstyled:classes
      :apps:frontend-theme-fjord:frontend-theme-fjord:createLiferayThemeJson
      npm WARN deprecated minimatch@2.0.10: Please update to minimatch 3.0.2 or higher to avoid a RegExp DoS issue
      npm WARN deprecated minimatch@0.2.14: Please update to minimatch 3.0.2 or higher to avoid a RegExp DoS issue
      npm WARN deprecated graceful-fs@1.2.3: graceful-fs v3.0.0 and before will fail on node releases >= v7.0. Please update to graceful-fs@^4.0.0 as soon as possible. Use 'npm ls graceful-fs' to find it in the tree.
      :apps:frontend-theme-fjord:frontend-theme-fjord:downloadNode
      :apps:frontend-theme-fjord:frontend-theme-fjord:expandFrontendCSSCommon
      :apps:frontend-theme-fjord:frontend-theme-fjord:saveMergeLangDestinationDir
      :apps:frontend-theme-fjord:frontend-theme-fjord:mergeLang
      :apps:frontend-theme-fjord:frontend-theme-fjord:npmInstall
      > node-sass@3.13.1 install C:\opt\dev\projects\github\liferay-portal-7.0.x-private\modules\apps\frontend-theme-1975-london\frontend-theme-1975-london\node_modules\gulp-metal\node_modules\node-sass
      > node scripts/install.js
      
      Cached binary found at C:\Users\Administrator\AppData\Roaming\npm-cache\node-sass\3.13.1\win32-x64-48_binding.node
      
      > node-sass@3.13.1 install C:\opt\dev\projects\github\liferay-portal-7.0.x-private\modules\apps\frontend-theme-1975-london\frontend-theme-1975-london\node_modules\node-sass
      > node scripts/install.js
      
      Cached binary found at C:\Users\Administrator\AppData\Roaming\npm-cache\node-sass\3.13.1\win32-x64-48_binding.node
      
      > liferay-theme-deps-7.0@1.0.0 install C:\opt\dev\projects\github\liferay-portal-7.0.x-private\modules\apps\frontend-theme-1975-london\frontend-theme-1975-london\node_modules\liferay-theme-deps-7.0
      > node scripts/install.js
      
      
      > coffee-script@1.12.8 postinstall C:\opt\dev\projects\github\liferay-portal-7.0.x-private\modules\apps\frontend-theme-1975-london\frontend-theme-1975-london\node_modules\coffee-script
      > node --eval 'if (require("./package.json").name === "coffee-script") { var red, yellow, cyan, reset; red = yellow = cyan = reset = ""; if (!process.env.NODE_DISABLE_COLORS) { red = "\x1b[31m"; yellow = "\x1b[33m"; cyan = "\x1b[36m"; reset = "\x1b[0m"; } console.warn(red + "CoffeeScript has moved!" + reset + " Please update references to " + yellow + "\"coffee-script\"" + reset + " to use " + yellow + "\"coffeescript\"" + reset + " (no hyphen) instead."); console.warn("Also, a new major version has been released under the " + yellow + "coffeescript" + reset + " name on NPM. This new release targets modern JavaScript, with minimal breaking changes. Learn more at " + cyan + "http://coffeescript.org" + reset + "."); console.warn(""); }'
      
      [eval]:1
      'if
      ^^^
      SyntaxError: Invalid or unexpected token
          at Object.exports.runInThisContext (vm.js:76:16)
          at Object.<anonymous> ([eval]-wrapper:6:22)
          at Module._compile (module.js:556:32)
          at bootstrap_node.js:357:29
          at _combinedTickCallback (internal/process/next_tick.js:67:7)
          at process._tickCallback (internal/process/next_tick.js:98:9)
      npm WARN optional SKIPPING OPTIONAL DEPENDENCY: fsevents@^1.0.0 (node_modules\gulp-metal\node_modules\chokidar\node_modules\fsevents):
      npm WARN notsup SKIPPING OPTIONAL DEPENDENCY: Unsupported platform for fsevents@1.1.3: wanted {"os":"darwin","arch":"any"} (current: {"os":"win32","arch":"x64"})
      npm WARN ajv-keywords@3.1.0 requires a peer of ajv@^6.0.0 but none is installed. You must install peer dependencies yourself.
      npm WARN liferay-1975-london-theme@1.0.31 No description
      npm WARN liferay-1975-london-theme@1.0.31 license should be a valid SPDX license expression
      npm WARN optional SKIPPING OPTIONAL DEPENDENCY: abbrev@1.1.0 (node_modules\fsevents\node_modules\abbrev):
      npm WARN enoent SKIPPING OPTIONAL DEPENDENCY: ENOENT: no such file or directory, rename 'C:\opt\dev\projects\github\liferay-portal-7.0.x-private\modules\apps\frontend-theme-1975-london\frontend-theme-1975-london\node_modules\fsevents\node_modules\abbrev' -> 'C:\opt\dev\projects\github\liferay-portal-7.0.x-private\modules\apps\frontend-theme-1975-london\frontend-theme-1975-london\node_modules\fsevents\node_modules\.abbrev.DELETE'
      npm WARN optional SKIPPING OPTIONAL DEPENDENCY: ansi-regex@2.1.1 (node_modules\fsevents\node_modules\ansi-regex):
      npm WARN enoent SKIPPING OPTIONAL DEPENDENCY: ENOENT: no such file or directory, rename 'C:\opt\dev\projects\github\liferay-portal-7.0.x-private\modules\apps\frontend-theme-1975-london\frontend-theme-1975-london\node_modules\fsevents\node_modules\ansi-regex' -> 'C:\opt\dev\projects\github\liferay-portal-7.0.x-private\modules\apps\frontend-theme-1975-london\frontend-theme-1975-london\node_modules\fsevents\node_modules\.ansi-regex.DELETE'
      npm WARN optional SKIPPING OPTIONAL DEPENDENCY: aproba@1.1.1 (node_modules\fsevents\node_modules\aproba):
      npm WARN enoent SKIPPING OPTIONAL DEPENDENCY: ENOENT: no such file or directory, rename 'C:\opt\dev\projects\github\liferay-portal-7.0.x-private\modules\apps\frontend-theme-1975-london\frontend-theme-1975-london\node_modules\fsevents\node_modules\aproba' -> 'C:\opt\dev\projects\github\liferay-portal-7.0.x-private\modules\apps\frontend-theme-1975-london\frontend-theme-1975-london\node_modules\fsevents\node_modules\.aproba.DELETE'
      npm WARN optional SKIPPING OPTIONAL DEPENDENCY: asn1@0.2.3 (node_modules\fsevents\node_modules\asn1):
      npm WARN enoent SKIPPING OPTIONAL DEPENDENCY: ENOENT: no such file or directory, rename 'C:\opt\dev\projects\github\liferay-portal-7.0.x-private\modules\apps\frontend-theme-1975-london\frontend-theme-1975-london\node_modules\fsevents\node_modules\asn1' -> 'C:\opt\dev\projects\github\liferay-portal-7.0.x-private\modules\apps\frontend-theme-1975-london\frontend-theme-1975-london\node_modules\fsevents\node_modules\.asn1.DELETE'
      npm WARN optional SKIPPING OPTIONAL DEPENDENCY: assert-plus@0.2.0 (node_modules\fsevents\node_modules\assert-plus):
      npm WARN enoent SKIPPING OPTIONAL DEPENDENCY: ENOENT: no such file or directory, rename 'C:\opt\dev\projects\github\liferay-portal-7.0.x-private\modules\apps\frontend-theme-1975-london\frontend-theme-1975-london\node_modules\fsevents\node_modules\assert-plus' -> 'C:\opt\dev\projects\github\liferay-portal-7.0.x-private\modules\apps\frontend-theme-1975-london\frontend-theme-1975-london\node_modules\fsevents\node_modules\.assert-plus.DELETE'
      npm WARN optional SKIPPING OPTIONAL DEPENDENCY: asynckit@0.4.0 (node_modules\fsevents\node_modules\asynckit):
      npm WARN enoent SKIPPING OPTIONAL DEPENDENCY: ENOENT: no such file or directory, rename 'C:\opt\dev\projects\github\liferay-portal-7.0.x-private\modules\apps\frontend-theme-1975-london\frontend-theme-1975-london\node_modules\fsevents\node_modules\asynckit' -> 'C:\opt\dev\projects\github\liferay-portal-7.0.x-private\modules\apps\frontend-theme-1975-london\frontend-theme-1975-london\node_modules\fsevents\node_modules\.asynckit.DELETE'
      npm WARN optional SKIPPING OPTIONAL DEPENDENCY: aws-sign2@0.6.0 (node_modules\fsevents\node_modules\aws-sign2):
      npm WARN enoent SKIPPING OPTIONAL DEPENDENCY: ENOENT: no such file or directory, rename 'C:\opt\dev\projects\github\liferay-portal-7.0.x-private\modules\apps\frontend-theme-1975-london\frontend-theme-1975-london\node_modules\fsevents\node_modules\aws-sign2' -> 'C:\opt\dev\projects\github\liferay-portal-7.0.x-private\modules\apps\frontend-theme-1975-london\frontend-theme-1975-london\node_modules\fsevents\node_modules\.aws-sign2.DELETE'
      npm WARN optional SKIPPING OPTIONAL DEPENDENCY: aws4@1.6.0 (node_modules\fsevents\node_modules\aws4):
      npm WARN enoent SKIPPING OPTIONAL DEPENDENCY: ENOENT: no such file or directory, rename 'C:\opt\dev\projects\github\liferay-portal-7.0.x-private\modules\apps\frontend-theme-1975-london\frontend-theme-1975-london\node_modules\fsevents\node_modules\aws4' -> 'C:\opt\dev\projects\github\liferay-portal-7.0.x-private\modules\apps\frontend-theme-1975-london\frontend-theme-1975-london\node_modules\fsevents\node_modules\.aws4.DELETE'
      npm WARN optional SKIPPING OPTIONAL DEPENDENCY: balanced-match@0.4.2 (node_modules\fsevents\node_modules\balanced-match):
      npm WARN enoent SKIPPING OPTIONAL DEPENDENCY: ENOENT: no such file or directory, rename 'C:\opt\dev\projects\github\liferay-portal-7.0.x-private\modules\apps\frontend-theme-1975-london\frontend-theme-1975-london\node_modules\fsevents\node_modules\balanced-match' -> 'C:\opt\dev\projects\github\liferay-portal-7.0.x-private\modules\apps\frontend-theme-1975-london\frontend-theme-1975-london\node_modules\fsevents\node_modules\.balanced-match.DELETE'
      npm WARN optional SKIPPING OPTIONAL DEPENDENCY: buffer-shims@1.0.0 (node_modules\fsevents\node_modules\buffer-shims):
      npm WARN enoent SKIPPING OPTIONAL DEPENDENCY: ENOENT: no such file or directory, rename 'C:\opt\dev\projects\github\liferay-portal-7.0.x-private\modules\apps\frontend-theme-1975-london\frontend-theme-1975-london\node_modules\fsevents\node_modules\buffer-shims' -> 'C:\opt\dev\projects\github\liferay-portal-7.0.x-private\modules\apps\frontend-theme-1975-london\frontend-theme-1975-london\node_modules\fsevents\node_modules\.buffer-shims.DELETE'
      npm WARN optional SKIPPING OPTIONAL DEPENDENCY: caseless@0.12.0 (node_modules\fsevents\node_modules\caseless):
      npm WARN enoent SKIPPING OPTIONAL DEPENDENCY: ENOENT: no such file or directory, rename 'C:\opt\dev\projects\github\liferay-portal-7.0.x-private\modules\apps\frontend-theme-1975-london\frontend-theme-1975-london\node_modules\fsevents\node_modules\caseless' -> 'C:\opt\dev\projects\github\liferay-portal-7.0.x-private\modules\apps\frontend-theme-1975-london\frontend-theme-1975-london\node_modules\fsevents\node_modules\.caseless.DELETE'
      npm WARN optional SKIPPING OPTIONAL DEPENDENCY: co@4.6.0 (node_modules\fsevents\node_modules\co):
      npm WARN enoent SKIPPING OPTIONAL DEPENDENCY: ENOENT: no such file or directory, rename 'C:\opt\dev\projects\github\liferay-portal-7.0.x-private\modules\apps\frontend-theme-1975-london\frontend-theme-1975-london\node_modules\fsevents\node_modules\co' -> 'C:\opt\dev\projects\github\liferay-portal-7.0.x-private\modules\apps\frontend-theme-1975-london\frontend-theme-1975-london\node_modules\fsevents\node_modules\.co.DELETE'
      npm WARN optional SKIPPING OPTIONAL DEPENDENCY: code-point-at@1.1.0 (node_modules\fsevents\node_modules\code-point-at):
      npm WARN enoent SKIPPING OPTIONAL DEPENDENCY: ENOENT: no such file or directory, rename 'C:\opt\dev\projects\github\liferay-portal-7.0.x-private\modules\apps\frontend-theme-1975-london\frontend-theme-1975-london\node_modules\fsevents\node_modules\code-point-at' -> 'C:\opt\dev\projects\github\liferay-portal-7.0.x-private\modules\apps\frontend-theme-1975-london\frontend-theme-1975-london\node_modules\fsevents\node_modules\.code-point-at.DELETE'
      npm WARN optional SKIPPING OPTIONAL DEPENDENCY: concat-map@0.0.1 (node_modules\fsevents\node_modules\concat-map):
      npm WARN enoent SKIPPING OPTIONAL DEPENDENCY: ENOENT: no such file or directory, rename 'C:\opt\dev\projects\github\liferay-portal-7.0.x-private\modules\apps\frontend-theme-1975-london\frontend-theme-1975-london\node_modules\fsevents\node_modules\concat-map' -> 'C:\opt\dev\projects\github\liferay-portal-7.0.x-private\modules\apps\frontend-theme-1975-london\frontend-theme-1975-london\node_modules\fsevents\node_modules\.concat-map.DELETE'
      npm WARN optional SKIPPING OPTIONAL DEPENDENCY: console-control-strings@1.1.0 (node_modules\fsevents\node_modules\console-control-strings):
      npm WARN enoent SKIPPING OPTIONAL DEPENDENCY: ENOENT: no such file or directory, rename 'C:\opt\dev\projects\github\liferay-portal-7.0.x-private\modules\apps\frontend-theme-1975-london\frontend-theme-1975-london\node_modules\fsevents\node_modules\console-control-strings' -> 'C:\opt\dev\projects\github\liferay-portal-7.0.x-private\modules\apps\frontend-theme-1975-london\frontend-theme-1975-london\node_modules\fsevents\node_modules\.console-control-strings.DELETE'
      npm WARN optional SKIPPING OPTIONAL DEPENDENCY: core-util-is@1.0.2 (node_modules\fsevents\node_modules\core-util-is):
      npm WARN enoent SKIPPING OPTIONAL DEPENDENCY: ENOENT: no such file or directory, rename 'C:\opt\dev\projects\github\liferay-portal-7.0.x-private\modules\apps\frontend-theme-1975-london\frontend-theme-1975-london\node_modules\fsevents\node_modules\core-util-is' -> 'C:\opt\dev\projects\github\liferay-portal-7.0.x-private\modules\apps\frontend-theme-1975-london\frontend-theme-1975-london\node_modules\fsevents\node_modules\.core-util-is.DELETE'
      npm WARN optional SKIPPING OPTIONAL DEPENDENCY: assert-plus@1.0.0 (node_modules\fsevents\node_modules\dashdash\node_modules\assert-plus):
      npm WARN enoent SKIPPING OPTIONAL DEPENDENCY: ENOENT: no such file or directory, rename 'C:\opt\dev\projects\github\liferay-portal-7.0.x-private\modules\apps\frontend-theme-1975-london\frontend-theme-1975-london\node_modules\fsevents\node_modules\dashdash\node_modules\assert-plus' -> 'C:\opt\dev\projects\github\liferay-portal-7.0.x-private\modules\apps\frontend-theme-1975-london\frontend-theme-1975-london\node_modules\fsevents\node_modules\dashdash\node_modules\.assert-plus.DELETE'
      npm WARN optional SKIPPING OPTIONAL DEPENDENCY: deep-extend@0.4.2 (node_modules\fsevents\node_modules\deep-extend):
      npm WARN enoent SKIPPING OPTIONAL DEPENDENCY: ENOENT: no such file or directory, rename 'C:\opt\dev\projects\github\liferay-portal-7.0.x-private\modules\apps\frontend-theme-1975-london\frontend-theme-1975-london\node_modules\fsevents\node_modules\deep-extend' -> 'C:\opt\dev\projects\github\liferay-portal-7.0.x-private\modules\apps\frontend-theme-1975-london\frontend-theme-1975-london\node_modules\fsevents\node_modules\.deep-extend.DELETE'
      npm WARN optional SKIPPING OPTIONAL DEPENDENCY: delayed-stream@1.0.0 (node_modules\fsevents\node_modules\delayed-stream):
      npm WARN enoent SKIPPING OPTIONAL DEPENDENCY: ENOENT: no such file or directory, rename 'C:\opt\dev\projects\github\liferay-portal-7.0.x-private\modules\apps\frontend-theme-1975-london\frontend-theme-1975-london\node_modules\fsevents\node_modules\delayed-stream' -> 'C:\opt\dev\projects\github\liferay-portal-7.0.x-private\modules\apps\frontend-theme-1975-london\frontend-theme-1975-london\node_modules\fsevents\node_modules\.delayed-stream.DELETE'
      npm WARN optional SKIPPING OPTIONAL DEPENDENCY: delegates@1.0.0 (node_modules\fsevents\node_modules\delegates):
      npm WARN enoent SKIPPING OPTIONAL DEPENDENCY: ENOENT: no such file or directory, rename 'C:\opt\dev\projects\github\liferay-portal-7.0.x-private\modules\apps\frontend-theme-1975-london\frontend-theme-1975-london\node_modules\fsevents\node_modules\delegates' -> 'C:\opt\dev\projects\github\liferay-portal-7.0.x-private\modules\apps\frontend-theme-1975-london\frontend-theme-1975-london\node_modules\fsevents\node_modules\.delegates.DELETE'
      npm WARN optional SKIPPING OPTIONAL DEPENDENCY: detect-libc@1.0.2 (node_modules\fsevents\node_modules\detect-libc):
      npm WARN enoent SKIPPING OPTIONAL DEPENDENCY: ENOENT: no such file or directory, rename 'C:\opt\dev\projects\github\liferay-portal-7.0.x-private\modules\apps\frontend-theme-1975-london\frontend-theme-1975-london\node_modules\fsevents\node_modules\detect-libc' -> 'C:\opt\dev\projects\github\liferay-portal-7.0.x-private\modules\apps\frontend-theme-1975-london\frontend-theme-1975-london\node_modules\fsevents\node_modules\.detect-libc.DELETE'
      npm WARN optional SKIPPING OPTIONAL DEPENDENCY: extend@3.0.1 (node_modules\fsevents\node_modules\extend):
      npm WARN enoent SKIPPING OPTIONAL DEPENDENCY: ENOENT: no such file or directory, rename 'C:\opt\dev\projects\github\liferay-portal-7.0.x-private\modules\apps\frontend-theme-1975-london\frontend-theme-1975-london\node_modules\fsevents\node_modules\extend' -> 'C:\opt\dev\projects\github\liferay-portal-7.0.x-private\modules\apps\frontend-theme-1975-london\frontend-theme-1975-london\node_modules\fsevents\node_modules\.extend.DELETE'
      npm WARN optional SKIPPING OPTIONAL DEPENDENCY: extsprintf@1.0.2 (node_modules\fsevents\node_modules\extsprintf):
      npm WARN enoent SKIPPING OPTIONAL DEPENDENCY: ENOENT: no such file or directory, rename 'C:\opt\dev\projects\github\liferay-portal-7.0.x-private\modules\apps\frontend-theme-1975-london\frontend-theme-1975-london\node_modules\fsevents\node_modules\extsprintf' -> 'C:\opt\dev\projects\github\liferay-portal-7.0.x-private\modules\apps\frontend-theme-1975-london\frontend-theme-1975-london\node_modules\fsevents\node_modules\.extsprintf.DELETE'
      npm WARN optional SKIPPING OPTIONAL DEPENDENCY: forever-agent@0.6.1 (node_modules\fsevents\node_modules\forever-agent):
      npm WARN enoent SKIPPING OPTIONAL DEPENDENCY: ENOENT: no such file or directory, rename 'C:\opt\dev\projects\github\liferay-portal-7.0.x-private\modules\apps\frontend-theme-1975-london\frontend-theme-1975-london\node_modules\fsevents\node_modules\forever-agent' -> 'C:\opt\dev\projects\github\liferay-portal-7.0.x-private\modules\apps\frontend-theme-1975-london\frontend-theme-1975-london\node_modules\fsevents\node_modules\.forever-agent.DELETE'
      npm WARN optional SKIPPING OPTIONAL DEPENDENCY: fs.realpath@1.0.0 (node_modules\fsevents\node_modules\fs.realpath):
      npm WARN enoent SKIPPING OPTIONAL DEPENDENCY: ENOENT: no such file or directory, rename 'C:\opt\dev\projects\github\liferay-portal-7.0.x-private\modules\apps\frontend-theme-1975-london\frontend-theme-1975-london\node_modules\fsevents\node_modules\fs.realpath' -> 'C:\opt\dev\projects\github\liferay-portal-7.0.x-private\modules\apps\frontend-theme-1975-london\frontend-theme-1975-london\node_modules\fsevents\node_modules\.fs.realpath.DELETE'
      npm WARN optional SKIPPING OPTIONAL DEPENDENCY: assert-plus@1.0.0 (node_modules\fsevents\node_modules\getpass\node_modules\assert-plus):
      npm WARN enoent SKIPPING OPTIONAL DEPENDENCY: ENOENT: no such file or directory, rename 'C:\opt\dev\projects\github\liferay-portal-7.0.x-private\modules\apps\frontend-theme-1975-london\frontend-theme-1975-london\node_modules\fsevents\node_modules\getpass\node_modules\assert-plus' -> 'C:\opt\dev\projects\github\liferay-portal-7.0.x-private\modules\apps\frontend-theme-1975-london\frontend-theme-1975-london\node_modules\fsevents\node_modules\getpass\node_modules\.assert-plus.DELETE'
      npm WARN optional SKIPPING OPTIONAL DEPENDENCY: graceful-fs@4.1.11 (node_modules\fsevents\node_modules\graceful-fs):
      npm WARN enoent SKIPPING OPTIONAL DEPENDENCY: ENOENT: no such file or directory, rename 'C:\opt\dev\projects\github\liferay-portal-7.0.x-private\modules\apps\frontend-theme-1975-london\frontend-theme-1975-london\node_modules\fsevents\node_modules\graceful-fs' -> 'C:\opt\dev\projects\github\liferay-portal-7.0.x-private\modules\apps\frontend-theme-1975-london\frontend-theme-1975-london\node_modules\fsevents\node_modules\.graceful-fs.DELETE'
      npm WARN optional SKIPPING OPTIONAL DEPENDENCY: har-schema@1.0.5 (node_modules\fsevents\node_modules\har-schema):
      npm WARN enoent SKIPPING OPTIONAL DEPENDENCY: ENOENT: no such file or directory, rename 'C:\opt\dev\projects\github\liferay-portal-7.0.x-private\modules\apps\frontend-theme-1975-london\frontend-theme-1975-london\node_modules\fsevents\node_modules\har-schema' -> 'C:\opt\dev\projects\github\liferay-portal-7.0.x-private\modules\apps\frontend-theme-1975-london\frontend-theme-1975-london\node_modules\fsevents\node_modules\.har-schema.DELETE'
      npm WARN optional SKIPPING OPTIONAL DEPENDENCY: has-unicode@2.0.1 (node_modules\fsevents\node_modules\has-unicode):
      npm WARN enoent SKIPPING OPTIONAL DEPENDENCY: ENOENT: no such file or directory, rename 'C:\opt\dev\projects\github\liferay-portal-7.0.x-private\modules\apps\frontend-theme-1975-london\frontend-theme-1975-london\node_modules\fsevents\node_modules\has-unicode' -> 'C:\opt\dev\projects\github\liferay-portal-7.0.x-private\modules\apps\frontend-theme-1975-london\frontend-theme-1975-london\node_modules\fsevents\node_modules\.has-unicode.DELETE'
      npm WARN optional SKIPPING OPTIONAL DEPENDENCY: hoek@2.16.3 (node_modules\fsevents\node_modules\hoek):
      npm WARN enoent SKIPPING OPTIONAL DEPENDENCY: ENOENT: no such file or directory, rename 'C:\opt\dev\projects\github\liferay-portal-7.0.x-private\modules\apps\frontend-theme-1975-london\frontend-theme-1975-london\node_modules\fsevents\node_modules\hoek' -> 'C:\opt\dev\projects\github\liferay-portal-7.0.x-private\modules\apps\frontend-theme-1975-london\frontend-theme-1975-london\node_modules\fsevents\node_modules\.hoek.DELETE'
      npm WARN optional SKIPPING OPTIONAL DEPENDENCY: inherits@2.0.3 (node_modules\fsevents\node_modules\inherits):
      npm WARN enoent SKIPPING OPTIONAL DEPENDENCY: ENOENT: no such file or directory, rename 'C:\opt\dev\projects\github\liferay-portal-7.0.x-private\modules\apps\frontend-theme-1975-london\frontend-theme-1975-london\node_modules\fsevents\node_modules\inherits' -> 'C:\opt\dev\projects\github\liferay-portal-7.0.x-private\modules\apps\frontend-theme-1975-london\frontend-theme-1975-london\node_modules\fsevents\node_modules\.inherits.DELETE'
      npm WARN optional SKIPPING OPTIONAL DEPENDENCY: ini@1.3.4 (node_modules\fsevents\node_modules\ini):
      npm WARN enoent SKIPPING OPTIONAL DEPENDENCY: ENOENT: no such file or directory, rename 'C:\opt\dev\projects\github\liferay-portal-7.0.x-private\modules\apps\frontend-theme-1975-london\frontend-theme-1975-london\node_modules\fsevents\node_modules\ini' -> 'C:\opt\dev\projects\github\liferay-portal-7.0.x-private\modules\apps\frontend-theme-1975-london\frontend-theme-1975-london\node_modules\fsevents\node_modules\.ini.DELETE'
      npm WARN optional SKIPPING OPTIONAL DEPENDENCY: is-typedarray@1.0.0 (node_modules\fsevents\node_modules\is-typedarray):
      npm WARN enoent SKIPPING OPTIONAL DEPENDENCY: ENOENT: no such file or directory, rename 'C:\opt\dev\projects\github\liferay-portal-7.0.x-private\modules\apps\frontend-theme-1975-london\frontend-theme-1975-london\node_modules\fsevents\node_modules\is-typedarray' -> 'C:\opt\dev\projects\github\liferay-portal-7.0.x-private\modules\apps\frontend-theme-1975-london\frontend-theme-1975-london\node_modules\fsevents\node_modules\.is-typedarray.DELETE'
      npm WARN optional SKIPPING OPTIONAL DEPENDENCY: isarray@1.0.0 (node_modules\fsevents\node_modules\isarray):
      npm WARN enoent SKIPPING OPTIONAL DEPENDENCY: ENOENT: no such file or directory, rename 'C:\opt\dev\projects\github\liferay-portal-7.0.x-private\modules\apps\frontend-theme-1975-london\frontend-theme-1975-london\node_modules\fsevents\node_modules\isarray' -> 'C:\opt\dev\projects\github\liferay-portal-7.0.x-private\modules\apps\frontend-theme-1975-london\frontend-theme-1975-london\node_modules\fsevents\node_modules\.isarray.DELETE'
      npm WARN optional SKIPPING OPTIONAL DEPENDENCY: isstream@0.1.2 (node_modules\fsevents\node_modules\isstream):
      npm WARN enoent SKIPPING OPTIONAL DEPENDENCY: ENOENT: no such file or directory, rename 'C:\opt\dev\projects\github\liferay-portal-7.0.x-private\modules\apps\frontend-theme-1975-london\frontend-theme-1975-london\node_modules\fsevents\node_modules\isstream' -> 'C:\opt\dev\projects\github\liferay-portal-7.0.x-private\modules\apps\frontend-theme-1975-london\frontend-theme-1975-london\node_modules\fsevents\node_modules\.isstream.DELETE'
      npm WARN optional SKIPPING OPTIONAL DEPENDENCY: jsbn@0.1.1 (node_modules\fsevents\node_modules\jsbn):
      npm WARN enoent SKIPPING OPTIONAL DEPENDENCY: ENOENT: no such file or directory, rename 'C:\opt\dev\projects\github\liferay-portal-7.0.x-private\modules\apps\frontend-theme-1975-london\frontend-theme-1975-london\node_modules\fsevents\node_modules\jsbn' -> 'C:\opt\dev\projects\github\liferay-portal-7.0.x-private\modules\apps\frontend-theme-1975-london\frontend-theme-1975-london\node_modules\fsevents\node_modules\.jsbn.DELETE'
      npm WARN optional SKIPPING OPTIONAL DEPENDENCY: ecc-jsbn@0.1.1 (node_modules\fsevents\node_modules\ecc-jsbn):
      npm WARN enoent SKIPPING OPTIONAL DEPENDENCY: ENOENT: no such file or directory, rename 'C:\opt\dev\projects\github\liferay-portal-7.0.x-private\modules\apps\frontend-theme-1975-london\frontend-theme-1975-london\node_modules\fsevents\node_modules\ecc-jsbn' -> 'C:\opt\dev\projects\github\liferay-portal-7.0.x-private\modules\apps\frontend-theme-1975-london\frontend-theme-1975-london\node_modules\fsevents\node_modules\.ecc-jsbn.DELETE'
      npm WARN optional SKIPPING OPTIONAL DEPENDENCY: jodid25519@1.0.2 (node_modules\fsevents\node_modules\jodid25519):
      npm WARN enoent SKIPPING OPTIONAL DEPENDENCY: ENOENT: no such file or directory, rename 'C:\opt\dev\projects\github\liferay-portal-7.0.x-private\modules\apps\frontend-theme-1975-london\frontend-theme-1975-london\node_modules\fsevents\node_modules\jodid25519' -> 'C:\opt\dev\projects\github\liferay-portal-7.0.x-private\modules\apps\frontend-theme-1975-london\frontend-theme-1975-london\node_modules\fsevents\node_modules\.jodid25519.DELETE'
      npm WARN optional SKIPPING OPTIONAL DEPENDENCY: json-schema@0.2.3 (node_modules\fsevents\node_modules\json-schema):
      npm WARN enoent SKIPPING OPTIONAL DEPENDENCY: ENOENT: no such file or directory, rename 'C:\opt\dev\projects\github\liferay-portal-7.0.x-private\modules\apps\frontend-theme-1975-london\frontend-theme-1975-london\node_modules\fsevents\node_modules\json-schema' -> 'C:\opt\dev\projects\github\liferay-portal-7.0.x-private\modules\apps\frontend-theme-1975-london\frontend-theme-1975-london\node_modules\fsevents\node_modules\.json-schema.DELETE'
      npm WARN optional SKIPPING OPTIONAL DEPENDENCY: json-stringify-safe@5.0.1 (node_modules\fsevents\node_modules\json-stringify-safe):
      npm WARN enoent SKIPPING OPTIONAL DEPENDENCY: ENOENT: no such file or directory, rename 'C:\opt\dev\projects\github\liferay-portal-7.0.x-private\modules\apps\frontend-theme-1975-london\frontend-theme-1975-london\node_modules\fsevents\node_modules\json-stringify-safe' -> 'C:\opt\dev\projects\github\liferay-portal-7.0.x-private\modules\apps\frontend-theme-1975-london\frontend-theme-1975-london\node_modules\fsevents\node_modules\.json-stringify-safe.DELETE'
      npm WARN optional SKIPPING OPTIONAL DEPENDENCY: jsonify@0.0.0 (node_modules\fsevents\node_modules\jsonify):
      npm WARN enoent SKIPPING OPTIONAL DEPENDENCY: ENOENT: no such file or directory, rename 'C:\opt\dev\projects\github\liferay-portal-7.0.x-private\modules\apps\frontend-theme-1975-london\frontend-theme-1975-london\node_modules\fsevents\node_modules\jsonify' -> 'C:\opt\dev\projects\github\liferay-portal-7.0.x-private\modules\apps\frontend-theme-1975-london\frontend-theme-1975-london\node_modules\fsevents\node_modules\.jsonify.DELETE'
      npm WARN optional SKIPPING OPTIONAL DEPENDENCY: assert-plus@1.0.0 (node_modules\fsevents\node_modules\jsprim\node_modules\assert-plus):
      npm WARN enoent SKIPPING OPTIONAL DEPENDENCY: ENOENT: no such file or directory, rename 'C:\opt\dev\projects\github\liferay-portal-7.0.x-private\modules\apps\frontend-theme-1975-london\frontend-theme-1975-london\node_modules\fsevents\node_modules\jsprim\node_modules\assert-plus' -> 'C:\opt\dev\projects\github\liferay-portal-7.0.x-private\modules\apps\frontend-theme-1975-london\frontend-theme-1975-london\node_modules\fsevents\node_modules\jsprim\node_modules\.assert-plus.DELETE'
      npm WARN optional SKIPPING OPTIONAL DEPENDENCY: mime-db@1.27.0 (node_modules\fsevents\node_modules\mime-db):
      npm WARN enoent SKIPPING OPTIONAL DEPENDENCY: ENOENT: no such file or directory, rename 'C:\opt\dev\projects\github\liferay-portal-7.0.x-private\modules\apps\frontend-theme-1975-london\frontend-theme-1975-london\node_modules\fsevents\node_modules\mime-db' -> 'C:\opt\dev\projects\github\liferay-portal-7.0.x-private\modules\apps\frontend-theme-1975-london\frontend-theme-1975-london\node_modules\fsevents\node_modules\.mime-db.DELETE'
      npm WARN optional SKIPPING OPTIONAL DEPENDENCY: minimist@0.0.8 (node_modules\fsevents\node_modules\minimist):
      npm WARN enoent SKIPPING OPTIONAL DEPENDENCY: ENOENT: no such file or directory, rename 'C:\opt\dev\projects\github\liferay-portal-7.0.x-private\modules\apps\frontend-theme-1975-london\frontend-theme-1975-london\node_modules\fsevents\node_modules\minimist' -> 'C:\opt\dev\projects\github\liferay-portal-7.0.x-private\modules\apps\frontend-theme-1975-london\frontend-theme-1975-london\node_modules\fsevents\node_modules\.minimist.DELETE'
      npm WARN optional SKIPPING OPTIONAL DEPENDENCY: ms@2.0.0 (node_modules\fsevents\node_modules\ms):
      npm WARN enoent SKIPPING OPTIONAL DEPENDENCY: ENOENT: no such file or directory, rename 'C:\opt\dev\projects\github\liferay-portal-7.0.x-private\modules\apps\frontend-theme-1975-london\frontend-theme-1975-london\node_modules\fsevents\node_modules\ms' -> 'C:\opt\dev\projects\github\liferay-portal-7.0.x-private\modules\apps\frontend-theme-1975-london\frontend-theme-1975-london\node_modules\fsevents\node_modules\.ms.DELETE'
      npm WARN optional SKIPPING OPTIONAL DEPENDENCY: number-is-nan@1.0.1 (node_modules\fsevents\node_modules\number-is-nan):
      npm WARN enoent SKIPPING OPTIONAL DEPENDENCY: ENOENT: no such file or directory, rename 'C:\opt\dev\projects\github\liferay-portal-7.0.x-private\modules\apps\frontend-theme-1975-london\frontend-theme-1975-london\node_modules\fsevents\node_modules\number-is-nan' -> 'C:\opt\dev\projects\github\liferay-portal-7.0.x-private\modules\apps\frontend-theme-1975-london\frontend-theme-1975-london\node_modules\fsevents\node_modules\.number-is-nan.DELETE'
      npm WARN optional SKIPPING OPTIONAL DEPENDENCY: oauth-sign@0.8.2 (node_modules\fsevents\node_modules\oauth-sign):
      npm WARN enoent SKIPPING OPTIONAL DEPENDENCY: ENOENT: no such file or directory, rename 'C:\opt\dev\projects\github\liferay-portal-7.0.x-private\modules\apps\frontend-theme-1975-london\frontend-theme-1975-london\node_modules\fsevents\node_modules\oauth-sign' -> 'C:\opt\dev\projects\github\liferay-portal-7.0.x-private\modules\apps\frontend-theme-1975-london\frontend-theme-1975-london\node_modules\fsevents\node_modules\.oauth-sign.DELETE'
      npm WARN optional SKIPPING OPTIONAL DEPENDENCY: object-assign@4.1.1 (node_modules\fsevents\node_modules\object-assign):
      npm WARN enoent SKIPPING OPTIONAL DEPENDENCY: ENOENT: no such file or directory, rename 'C:\opt\dev\projects\github\liferay-portal-7.0.x-private\modules\apps\frontend-theme-1975-london\frontend-theme-1975-london\node_modules\fsevents\node_modules\object-assign' -> 'C:\opt\dev\projects\github\liferay-portal-7.0.x-private\modules\apps\frontend-theme-1975-london\frontend-theme-1975-london\node_modules\fsevents\node_modules\.object-assign.DELETE'
      npm WARN optional SKIPPING OPTIONAL DEPENDENCY: os-homedir@1.0.2 (node_modules\fsevents\node_modules\os-homedir):
      npm WARN enoent SKIPPING OPTIONAL DEPENDENCY: ENOENT: no such file or directory, rename 'C:\opt\dev\projects\github\liferay-portal-7.0.x-private\modules\apps\frontend-theme-1975-london\frontend-theme-1975-london\node_modules\fsevents\node_modules\os-homedir' -> 'C:\opt\dev\projects\github\liferay-portal-7.0.x-private\modules\apps\frontend-theme-1975-london\frontend-theme-1975-london\node_modules\fsevents\node_modules\.os-homedir.DELETE'
      npm WARN optional SKIPPING OPTIONAL DEPENDENCY: os-tmpdir@1.0.2 (node_modules\fsevents\node_modules\os-tmpdir):
      npm WARN enoent SKIPPING OPTIONAL DEPENDENCY: ENOENT: no such file or directory, rename 'C:\opt\dev\projects\github\liferay-portal-7.0.x-private\modules\apps\frontend-theme-1975-london\frontend-theme-1975-london\node_modules\fsevents\node_modules\os-tmpdir' -> 'C:\opt\dev\projects\github\liferay-portal-7.0.x-private\modules\apps\frontend-theme-1975-london\frontend-theme-1975-london\node_modules\fsevents\node_modules\.os-tmpdir.DELETE'
      npm WARN optional SKIPPING OPTIONAL DEPENDENCY: path-is-absolute@1.0.1 (node_modules\fsevents\node_modules\path-is-absolute):
      npm WARN enoent SKIPPING OPTIONAL DEPENDENCY: ENOENT: no such file or directory, rename 'C:\opt\dev\projects\github\liferay-portal-7.0.x-private\modules\apps\frontend-theme-1975-london\frontend-theme-1975-london\node_modules\fsevents\node_modules\path-is-absolute' -> 'C:\opt\dev\projects\github\liferay-portal-7.0.x-private\modules\apps\frontend-theme-1975-london\frontend-theme-1975-london\node_modules\fsevents\node_modules\.path-is-absolute.DELETE'
      npm WARN optional SKIPPING OPTIONAL DEPENDENCY: performance-now@0.2.0 (node_modules\fsevents\node_modules\performance-now):
      npm WARN enoent SKIPPING OPTIONAL DEPENDENCY: ENOENT: no such file or directory, rename 'C:\opt\dev\projects\github\liferay-portal-7.0.x-private\modules\apps\frontend-theme-1975-london\frontend-theme-1975-london\node_modules\fsevents\node_modules\performance-now' -> 'C:\opt\dev\projects\github\liferay-portal-7.0.x-private\modules\apps\frontend-theme-1975-london\frontend-theme-1975-london\node_modules\fsevents\node_modules\.performance-now.DELETE'
      npm WARN optional SKIPPING OPTIONAL DEPENDENCY: process-nextick-args@1.0.7 (node_modules\fsevents\node_modules\process-nextick-args):
      npm WARN enoent SKIPPING OPTIONAL DEPENDENCY: ENOENT: no such file or directory, rename 'C:\opt\dev\projects\github\liferay-portal-7.0.x-private\modules\apps\frontend-theme-1975-london\frontend-theme-1975-london\node_modules\fsevents\node_modules\process-nextick-args' -> 'C:\opt\dev\projects\github\liferay-portal-7.0.x-private\modules\apps\frontend-theme-1975-london\frontend-theme-1975-london\node_modules\fsevents\node_modules\.process-nextick-args.DELETE'
      npm WARN optional SKIPPING OPTIONAL DEPENDENCY: punycode@1.4.1 (node_modules\fsevents\node_modules\punycode):
      npm WARN enoent SKIPPING OPTIONAL DEPENDENCY: ENOENT: no such file or directory, rename 'C:\opt\dev\projects\github\liferay-portal-7.0.x-private\modules\apps\frontend-theme-1975-london\frontend-theme-1975-london\node_modules\fsevents\node_modules\punycode' -> 'C:\opt\dev\projects\github\liferay-portal-7.0.x-private\modules\apps\frontend-theme-1975-london\frontend-theme-1975-london\node_modules\fsevents\node_modules\.punycode.DELETE'
      npm WARN optional SKIPPING OPTIONAL DEPENDENCY: qs@6.4.0 (node_modules\fsevents\node_modules\qs):
      npm WARN enoent SKIPPING OPTIONAL DEPENDENCY: ENOENT: no such file or directory, rename 'C:\opt\dev\projects\github\liferay-portal-7.0.x-private\modules\apps\frontend-theme-1975-london\frontend-theme-1975-london\node_modules\fsevents\node_modules\qs' -> 'C:\opt\dev\projects\github\liferay-portal-7.0.x-private\modules\apps\frontend-theme-1975-london\frontend-theme-1975-london\node_modules\fsevents\node_modules\.qs.DELETE'
      npm WARN optional SKIPPING OPTIONAL DEPENDENCY: minimist@1.2.0 (node_modules\fsevents\node_modules\rc\node_modules\minimist):
      npm WARN enoent SKIPPING OPTIONAL DEPENDENCY: ENOENT: no such file or directory, rename 'C:\opt\dev\projects\github\liferay-portal-7.0.x-private\modules\apps\frontend-theme-1975-london\frontend-theme-1975-london\node_modules\fsevents\node_modules\rc\node_modules\minimist' -> 'C:\opt\dev\projects\github\liferay-portal-7.0.x-private\modules\apps\frontend-theme-1975-london\frontend-theme-1975-london\node_modules\fsevents\node_modules\rc\node_modules\.minimist.DELETE'
      npm WARN optional SKIPPING OPTIONAL DEPENDENCY: safe-buffer@5.0.1 (node_modules\fsevents\node_modules\safe-buffer):
      npm WARN enoent SKIPPING OPTIONAL DEPENDENCY: ENOENT: no such file or directory, rename 'C:\opt\dev\projects\github\liferay-portal-7.0.x-private\modules\apps\frontend-theme-1975-london\frontend-theme-1975-london\node_modules\fsevents\node_modules\safe-buffer' -> 'C:\opt\dev\projects\github\liferay-portal-7.0.x-private\modules\apps\frontend-theme-1975-london\frontend-theme-1975-london\node_modules\fsevents\node_modules\.safe-buffer.DELETE'
      npm WARN optional SKIPPING OPTIONAL DEPENDENCY: semver@5.3.0 (node_modules\fsevents\node_modules\semver):
      npm WARN enoent SKIPPING OPTIONAL DEPENDENCY: ENOENT: no such file or directory, rename 'C:\opt\dev\projects\github\liferay-portal-7.0.x-private\modules\apps\frontend-theme-1975-london\frontend-theme-1975-london\node_modules\fsevents\node_modules\semver' -> 'C:\opt\dev\projects\github\liferay-portal-7.0.x-private\modules\apps\frontend-theme-1975-london\frontend-theme-1975-london\node_modules\fsevents\node_modules\.semver.DELETE'
      npm WARN optional SKIPPING OPTIONAL DEPENDENCY: set-blocking@2.0.0 (node_modules\fsevents\node_modules\set-blocking):
      npm WARN enoent SKIPPING OPTIONAL DEPENDENCY: ENOENT: no such file or directory, rename 'C:\opt\dev\projects\github\liferay-portal-7.0.x-private\modules\apps\frontend-theme-1975-london\frontend-theme-1975-london\node_modules\fsevents\node_modules\set-blocking' -> 'C:\opt\dev\projects\github\liferay-portal-7.0.x-private\modules\apps\frontend-theme-1975-london\frontend-theme-1975-london\node_modules\fsevents\node_modules\.set-blocking.DELETE'
      npm WARN optional SKIPPING OPTIONAL DEPENDENCY: signal-exit@3.0.2 (node_modules\fsevents\node_modules\signal-exit):
      npm WARN enoent SKIPPING OPTIONAL DEPENDENCY: ENOENT: no such file or directory, rename 'C:\opt\dev\projects\github\liferay-portal-7.0.x-private\modules\apps\frontend-theme-1975-london\frontend-theme-1975-london\node_modules\fsevents\node_modules\signal-exit' -> 'C:\opt\dev\projects\github\liferay-portal-7.0.x-private\modules\apps\frontend-theme-1975-london\frontend-theme-1975-london\node_modules\fsevents\node_modules\.signal-exit.DELETE'
      npm WARN optional SKIPPING OPTIONAL DEPENDENCY: assert-plus@1.0.0 (node_modules\fsevents\node_modules\sshpk\node_modules\assert-plus):
      npm WARN enoent SKIPPING OPTIONAL DEPENDENCY: ENOENT: no such file or directory, rename 'C:\opt\dev\projects\github\liferay-portal-7.0.x-private\modules\apps\frontend-theme-1975-london\frontend-theme-1975-london\node_modules\fsevents\node_modules\sshpk\node_modules\assert-plus' -> 'C:\opt\dev\projects\github\liferay-portal-7.0.x-private\modules\apps\frontend-theme-1975-london\frontend-theme-1975-london\node_modules\fsevents\node_modules\sshpk\node_modules\.assert-plus.DELETE'
      npm WARN optional SKIPPING OPTIONAL DEPENDENCY: stringstream@0.0.5 (node_modules\fsevents\node_modules\stringstream):
      npm WARN enoent SKIPPING OPTIONAL DEPENDENCY: ENOENT: no such file or directory, rename 'C:\opt\dev\projects\github\liferay-portal-7.0.x-private\modules\apps\frontend-theme-1975-london\frontend-theme-1975-london\node_modules\fsevents\node_modules\stringstream' -> 'C:\opt\dev\projects\github\liferay-portal-7.0.x-private\modules\apps\frontend-theme-1975-london\frontend-theme-1975-london\node_modules\fsevents\node_modules\.stringstream.DELETE'
      npm WARN optional SKIPPING OPTIONAL DEPENDENCY: strip-json-comments@2.0.1 (node_modules\fsevents\node_modules\strip-json-comments):
      npm WARN enoent SKIPPING OPTIONAL DEPENDENCY: ENOENT: no such file or directory, rename 'C:\opt\dev\projects\github\liferay-portal-7.0.x-private\modules\apps\frontend-theme-1975-london\frontend-theme-1975-london\node_modules\fsevents\node_modules\strip-json-comments' -> 'C:\opt\dev\projects\github\liferay-portal-7.0.x-private\modules\apps\frontend-theme-1975-london\frontend-theme-1975-london\node_modules\fsevents\node_modules\.strip-json-comments.DELETE'
      npm WARN optional SKIPPING OPTIONAL DEPENDENCY: tweetnacl@0.14.5 (node_modules\fsevents\node_modules\tweetnacl):
      npm WARN enoent SKIPPING OPTIONAL DEPENDENCY: ENOENT: no such file or directory, rename 'C:\opt\dev\projects\github\liferay-portal-7.0.x-private\modules\apps\frontend-theme-1975-london\frontend-theme-1975-london\node_modules\fsevents\node_modules\tweetnacl' -> 'C:\opt\dev\projects\github\liferay-portal-7.0.x-private\modules\apps\frontend-theme-1975-london\frontend-theme-1975-london\node_modules\fsevents\node_modules\.tweetnacl.DELETE'
      npm WARN optional SKIPPING OPTIONAL DEPENDENCY: bcrypt-pbkdf@1.0.1 (node_modules\fsevents\node_modules\bcrypt-pbkdf):
      npm WARN enoent SKIPPING OPTIONAL DEPENDENCY: ENOENT: no such file or directory, rename 'C:\opt\dev\projects\github\liferay-portal-7.0.x-private\modules\apps\frontend-theme-1975-london\frontend-theme-1975-london\node_modules\fsevents\node_modules\bcrypt-pbkdf' -> 'C:\opt\dev\projects\github\liferay-portal-7.0.x-private\modules\apps\frontend-theme-1975-london\frontend-theme-1975-london\node_modules\fsevents\node_modules\.bcrypt-pbkdf.DELETE'
      npm WARN optional SKIPPING OPTIONAL DEPENDENCY: uid-number@0.0.6 (node_modules\fsevents\node_modules\uid-number):
      npm WARN enoent SKIPPING OPTIONAL DEPENDENCY: ENOENT: no such file or directory, rename 'C:\opt\dev\projects\github\liferay-portal-7.0.x-private\modules\apps\frontend-theme-1975-london\frontend-theme-1975-london\node_modules\fsevents\node_modules\uid-number' -> 'C:\opt\dev\projects\github\liferay-portal-7.0.x-private\modules\apps\frontend-theme-1975-london\frontend-theme-1975-london\node_modules\fsevents\node_modules\.uid-number.DELETE'
      npm WARN optional SKIPPING OPTIONAL DEPENDENCY: util-deprecate@1.0.2 (node_modules\fsevents\node_modules\util-deprecate):
      npm WARN enoent SKIPPING OPTIONAL DEPENDENCY: ENOENT: no such file or directory, rename 'C:\opt\dev\projects\github\liferay-portal-7.0.x-private\modules\apps\frontend-theme-1975-london\frontend-theme-1975-london\node_modules\fsevents\node_modules\util-deprecate' -> 'C:\opt\dev\projects\github\liferay-portal-7.0.x-private\modules\apps\frontend-theme-1975-london\frontend-theme-1975-london\node_modules\fsevents\node_modules\.util-deprecate.DELETE'
      npm WARN optional SKIPPING OPTIONAL DEPENDENCY: uuid@3.0.1 (node_modules\fsevents\node_modules\uuid):
      npm WARN enoent SKIPPING OPTIONAL DEPENDENCY: ENOENT: no such file or directory, rename 'C:\opt\dev\projects\github\liferay-portal-7.0.x-private\modules\apps\frontend-theme-1975-london\frontend-theme-1975-london\node_modules\fsevents\node_modules\uuid' -> 'C:\opt\dev\projects\github\liferay-portal-7.0.x-private\modules\apps\frontend-theme-1975-london\frontend-theme-1975-london\node_modules\fsevents\node_modules\.uuid.DELETE'
      npm WARN optional SKIPPING OPTIONAL DEPENDENCY: wrappy@1.0.2 (node_modules\fsevents\node_modules\wrappy):
      npm WARN enoent SKIPPING OPTIONAL DEPENDENCY: ENOENT: no such file or directory, rename 'C:\opt\dev\projects\github\liferay-portal-7.0.x-private\modules\apps\frontend-theme-1975-london\frontend-theme-1975-london\node_modules\fsevents\node_modules\wrappy' -> 'C:\opt\dev\projects\github\liferay-portal-7.0.x-private\modules\apps\frontend-theme-1975-london\frontend-theme-1975-london\node_modules\fsevents\node_modules\.wrappy.DELETE'
      
      npm ERR! code ELIFECYCLE
      npm ERR! errno 1
      npm ERR! coffee-script@1.12.8 postinstall: `node --eval 'if (require("./package.json").name === "coffee-script") { var red, yellow, cyan, reset; red = yellow = cyan = reset = ""; if (!process.env.NODE_DISABLE_COLORS) { red = "\x1b[31m"; yellow = "\x1b[33m"; cyan = "\x1b[36m"; reset = "\x1b[0m"; } console.warn(red + "CoffeeScript has moved!" + reset + " Please update references to " + yellow + "\"coffee-script\"" + reset + " to use " + yellow + "\"coffeescript\"" + reset + " (no hyphen) instead."); console.warn("Also, a new major version has been released under the " + yellow + "coffeescript" + reset + " name on NPM. This new release targets modern JavaScript, with minimal breaking changes. Learn more at " + cyan + "http://coffeescript.org" + reset + "."); console.warn(""); }'`
      npm ERR! Exit status 1
      npm ERR! 
      npm ERR! Failed at the coffee-script@1.12.8 postinstall script.
      npm ERR! This is probably not a problem with npm. There is likely additional logging output above.
      
      npm ERR! A complete log of this run can be found in:
      npm ERR!     C:\Users\Administrator\AppData\Roaming\npm-cache\_logs\2018-03-30T20_36_07_986Z-debug.log
      
      Process '[cmd, /c, ""C:\opt\dev\projects\github\liferay-portal-7.0.x-private\modules\apps\frontend-theme-1975-london\frontend-theme-1975-london\build_gradle\node\node" "C:/opt/dev/projects/github/liferay-portal-7.0.x-private/modules/apps/frontend-theme-1975-london/frontend-theme-1975-london/build_gradle/node/node_modules/npm/bin/npm-cli.js" "--loglevel" "warn" "--progress" "true" "--registry" "http://mirrors.lax.liferay.com:4873" "install""]' finished with non-zero exit value 1. Running "npm install" again
      npm WARN deprecated minimatch@2.0.10: Please update to minimatch 3.0.2 or higher to avoid a RegExp DoS issue
      npm WARN deprecated minimatch@0.2.14: Please update to minimatch 3.0.2 or higher to avoid a RegExp DoS issue
      npm WARN deprecated graceful-fs@1.2.3: graceful-fs v3.0.0 and before will fail on node releases >= v7.0. Please update to graceful-fs@^4.0.0 as soon as possible. Use 'npm ls graceful-fs' to find it in the tree.
      
      > node-sass@3.13.1 install C:\opt\dev\projects\github\liferay-portal-7.0.x-private\modules\apps\frontend-theme-1975-london\frontend-theme-1975-london\node_modules\gulp-metal\node_modules\node-sass
      > node scripts/install.js
      
      Cached binary found at C:\Users\Administrator\AppData\Roaming\npm-cache\node-sass\3.13.1\win32-x64-48_binding.node
      
      > node-sass@3.13.1 install C:\opt\dev\projects\github\liferay-portal-7.0.x-private\modules\apps\frontend-theme-1975-london\frontend-theme-1975-london\node_modules\node-sass
      > node scripts/install.js
      
      Cached binary found at C:\Users\Administrator\AppData\Roaming\npm-cache\node-sass\3.13.1\win32-x64-48_binding.node
      
      > liferay-theme-deps-7.0@1.0.0 install C:\opt\dev\projects\github\liferay-portal-7.0.x-private\modules\apps\frontend-theme-1975-london\frontend-theme-1975-london\node_modules\liferay-theme-deps-7.0
      > node scripts/install.js
      
      
      > coffee-script@1.12.8 postinstall C:\opt\dev\projects\github\liferay-portal-7.0.x-private\modules\apps\frontend-theme-1975-london\frontend-theme-1975-london\node_modules\coffee-script
      > node --eval 'if (require("./package.json").name === "coffee-script") { var red, yellow, cyan, reset; red = yellow = cyan = reset = ""; if (!process.env.NODE_DISABLE_COLORS) { red = "\x1b[31m"; yellow = "\x1b[33m"; cyan = "\x1b[36m"; reset = "\x1b[0m"; } console.warn(red + "CoffeeScript has moved!" + reset + " Please update references to " + yellow + "\"coffee-script\"" + reset + " to use " + yellow + "\"coffeescript\"" + reset + " (no hyphen) instead."); console.warn("Also, a new major version has been released under the " + yellow + "coffeescript" + reset + " name on NPM. This new release targets modern JavaScript, with minimal breaking changes. Learn more at " + cyan + "http://coffeescript.org" + reset + "."); console.warn(""); }'
      
      [eval]:1
      'if
      ^^^
      SyntaxError: Invalid or unexpected token
          at Object.exports.runInThisContext (vm.js:76:16)
          at Object.<anonymous> ([eval]-wrapper:6:22)
          at Module._compile (module.js:556:32)
          at bootstrap_node.js:357:29
          at _combinedTickCallback (internal/process/next_tick.js:67:7)
          at process._tickCallback (internal/process/next_tick.js:98:9)
      npm WARN optional SKIPPING OPTIONAL DEPENDENCY: fsevents@^1.0.0 (node_modules\gulp-metal\node_modules\chokidar\node_modules\fsevents):
      npm WARN notsup SKIPPING OPTIONAL DEPENDENCY: Unsupported platform for fsevents@1.1.3: wanted {"os":"darwin","arch":"any"} (current: {"os":"win32","arch":"x64"})
      npm WARN ajv-keywords@3.1.0 requires a peer of ajv@^6.0.0 but none is installed. You must install peer dependencies yourself.
      npm WARN liferay-1975-london-theme@1.0.31 No description
      npm WARN liferay-1975-london-theme@1.0.31 license should be a valid SPDX license expression
      npm WARN optional SKIPPING OPTIONAL DEPENDENCY: abbrev@1.1.0 (node_modules\fsevents\node_modules\abbrev):
      npm WARN enoent SKIPPING OPTIONAL DEPENDENCY: ENOENT: no such file or directory, rename 'C:\opt\dev\projects\github\liferay-portal-7.0.x-private\modules\apps\frontend-theme-1975-london\frontend-theme-1975-london\node_modules\fsevents\node_modules\abbrev' -> 'C:\opt\dev\projects\github\liferay-portal-7.0.x-private\modules\apps\frontend-theme-1975-london\frontend-theme-1975-london\node_modules\fsevents\node_modules\.abbrev.DELETE'
      npm WARN optional SKIPPING OPTIONAL DEPENDENCY: ansi-regex@2.1.1 (node_modules\fsevents\node_modules\ansi-regex):
      npm WARN enoent SKIPPING OPTIONAL DEPENDENCY: ENOENT: no such file or directory, rename 'C:\opt\dev\projects\github\liferay-portal-7.0.x-private\modules\apps\frontend-theme-1975-london\frontend-theme-1975-london\node_modules\fsevents\node_modules\ansi-regex' -> 'C:\opt\dev\projects\github\liferay-portal-7.0.x-private\modules\apps\frontend-theme-1975-london\frontend-theme-1975-london\node_modules\fsevents\node_modules\.ansi-regex.DELETE'
      npm WARN optional SKIPPING OPTIONAL DEPENDENCY: aproba@1.1.1 (node_modules\fsevents\node_modules\aproba):
      npm WARN enoent SKIPPING OPTIONAL DEPENDENCY: ENOENT: no such file or directory, rename 'C:\opt\dev\projects\github\liferay-portal-7.0.x-private\modules\apps\frontend-theme-1975-london\frontend-theme-1975-london\node_modules\fsevents\node_modules\aproba' -> 'C:\opt\dev\projects\github\liferay-portal-7.0.x-private\modules\apps\frontend-theme-1975-london\frontend-theme-1975-london\node_modules\fsevents\node_modules\.aproba.DELETE'
      npm WARN optional SKIPPING OPTIONAL DEPENDENCY: asn1@0.2.3 (node_modules\fsevents\node_modules\asn1):
      npm WARN enoent SKIPPING OPTIONAL DEPENDENCY: ENOENT: no such file or directory, rename 'C:\opt\dev\projects\github\liferay-portal-7.0.x-private\modules\apps\frontend-theme-1975-london\frontend-theme-1975-london\node_modules\fsevents\node_modules\asn1' -> 'C:\opt\dev\projects\github\liferay-portal-7.0.x-private\modules\apps\frontend-theme-1975-london\frontend-theme-1975-london\node_modules\fsevents\node_modules\.asn1.DELETE'
      npm WARN optional SKIPPING OPTIONAL DEPENDENCY: assert-plus@0.2.0 (node_modules\fsevents\node_modules\assert-plus):
      npm WARN enoent SKIPPING OPTIONAL DEPENDENCY: ENOENT: no such file or directory, rename 'C:\opt\dev\projects\github\liferay-portal-7.0.x-private\modules\apps\frontend-theme-1975-london\frontend-theme-1975-london\node_modules\fsevents\node_modules\assert-plus' -> 'C:\opt\dev\projects\github\liferay-portal-7.0.x-private\modules\apps\frontend-theme-1975-london\frontend-theme-1975-london\node_modules\fsevents\node_modules\.assert-plus.DELETE'
      npm WARN optional SKIPPING OPTIONAL DEPENDENCY: asynckit@0.4.0 (node_modules\fsevents\node_modules\asynckit):
      npm WARN enoent SKIPPING OPTIONAL DEPENDENCY: ENOENT: no such file or directory, rename 'C:\opt\dev\projects\github\liferay-portal-7.0.x-private\modules\apps\frontend-theme-1975-london\frontend-theme-1975-london\node_modules\fsevents\node_modules\asynckit' -> 'C:\opt\dev\projects\github\liferay-portal-7.0.x-private\modules\apps\frontend-theme-1975-london\frontend-theme-1975-london\node_modules\fsevents\node_modules\.asynckit.DELETE'
      npm WARN optional SKIPPING OPTIONAL DEPENDENCY: aws-sign2@0.6.0 (node_modules\fsevents\node_modules\aws-sign2):
      npm WARN enoent SKIPPING OPTIONAL DEPENDENCY: ENOENT: no such file or directory, rename 'C:\opt\dev\projects\github\liferay-portal-7.0.x-private\modules\apps\frontend-theme-1975-london\frontend-theme-1975-london\node_modules\fsevents\node_modules\aws-sign2' -> 'C:\opt\dev\projects\github\liferay-portal-7.0.x-private\modules\apps\frontend-theme-1975-london\frontend-theme-1975-london\node_modules\fsevents\node_modules\.aws-sign2.DELETE'
      npm WARN optional SKIPPING OPTIONAL DEPENDENCY: aws4@1.6.0 (node_modules\fsevents\node_modules\aws4):
      npm WARN enoent SKIPPING OPTIONAL DEPENDENCY: ENOENT: no such file or directory, rename 'C:\opt\dev\projects\github\liferay-portal-7.0.x-private\modules\apps\frontend-theme-1975-london\frontend-theme-1975-london\node_modules\fsevents\node_modules\aws4' -> 'C:\opt\dev\projects\github\liferay-portal-7.0.x-private\modules\apps\frontend-theme-1975-london\frontend-theme-1975-london\node_modules\fsevents\node_modules\.aws4.DELETE'
      npm WARN optional SKIPPING OPTIONAL DEPENDENCY: balanced-match@0.4.2 (node_modules\fsevents\node_modules\balanced-match):
      npm WARN enoent SKIPPING OPTIONAL DEPENDENCY: ENOENT: no such file or directory, rename 'C:\opt\dev\projects\github\liferay-portal-7.0.x-private\modules\apps\frontend-theme-1975-london\frontend-theme-1975-london\node_modules\fsevents\node_modules\balanced-match' -> 'C:\opt\dev\projects\github\liferay-portal-7.0.x-private\modules\apps\frontend-theme-1975-london\frontend-theme-1975-london\node_modules\fsevents\node_modules\.balanced-match.DELETE'
      npm WARN optional SKIPPING OPTIONAL DEPENDENCY: buffer-shims@1.0.0 (node_modules\fsevents\node_modules\buffer-shims):
      npm WARN enoent SKIPPING OPTIONAL DEPENDENCY: ENOENT: no such file or directory, rename 'C:\opt\dev\projects\github\liferay-portal-7.0.x-private\modules\apps\frontend-theme-1975-london\frontend-theme-1975-london\node_modules\fsevents\node_modules\buffer-shims' -> 'C:\opt\dev\projects\github\liferay-portal-7.0.x-private\modules\apps\frontend-theme-1975-london\frontend-theme-1975-london\node_modules\fsevents\node_modules\.buffer-shims.DELETE'
      npm WARN optional SKIPPING OPTIONAL DEPENDENCY: caseless@0.12.0 (node_modules\fsevents\node_modules\caseless):
      npm WARN enoent SKIPPING OPTIONAL DEPENDENCY: ENOENT: no such file or directory, rename 'C:\opt\dev\projects\github\liferay-portal-7.0.x-private\modules\apps\frontend-theme-1975-london\frontend-theme-1975-london\node_modules\fsevents\node_modules\caseless' -> 'C:\opt\dev\projects\github\liferay-portal-7.0.x-private\modules\apps\frontend-theme-1975-london\frontend-theme-1975-london\node_modules\fsevents\node_modules\.caseless.DELETE'
      npm WARN optional SKIPPING OPTIONAL DEPENDENCY: co@4.6.0 (node_modules\fsevents\node_modules\co):
      npm WARN enoent SKIPPING OPTIONAL DEPENDENCY: ENOENT: no such file or directory, rename 'C:\opt\dev\projects\github\liferay-portal-7.0.x-private\modules\apps\frontend-theme-1975-london\frontend-theme-1975-london\node_modules\fsevents\node_modules\co' -> 'C:\opt\dev\projects\github\liferay-portal-7.0.x-private\modules\apps\frontend-theme-1975-london\frontend-theme-1975-london\node_modules\fsevents\node_modules\.co.DELETE'
      npm WARN optional SKIPPING OPTIONAL DEPENDENCY: code-point-at@1.1.0 (node_modules\fsevents\node_modules\code-point-at):
      npm WARN enoent SKIPPING OPTIONAL DEPENDENCY: ENOENT: no such file or directory, rename 'C:\opt\dev\projects\github\liferay-portal-7.0.x-private\modules\apps\frontend-theme-1975-london\frontend-theme-1975-london\node_modules\fsevents\node_modules\code-point-at' -> 'C:\opt\dev\projects\github\liferay-portal-7.0.x-private\modules\apps\frontend-theme-1975-london\frontend-theme-1975-london\node_modules\fsevents\node_modules\.code-point-at.DELETE'
      npm WARN optional SKIPPING OPTIONAL DEPENDENCY: concat-map@0.0.1 (node_modules\fsevents\node_modules\concat-map):
      npm WARN enoent SKIPPING OPTIONAL DEPENDENCY: ENOENT: no such file or directory, rename 'C:\opt\dev\projects\github\liferay-portal-7.0.x-private\modules\apps\frontend-theme-1975-london\frontend-theme-1975-london\node_modules\fsevents\node_modules\concat-map' -> 'C:\opt\dev\projects\github\liferay-portal-7.0.x-private\modules\apps\frontend-theme-1975-london\frontend-theme-1975-london\node_modules\fsevents\node_modules\.concat-map.DELETE'
      npm WARN optional SKIPPING OPTIONAL DEPENDENCY: console-control-strings@1.1.0 (node_modules\fsevents\node_modules\console-control-strings):
      npm WARN enoent SKIPPING OPTIONAL DEPENDENCY: ENOENT: no such file or directory, rename 'C:\opt\dev\projects\github\liferay-portal-7.0.x-private\modules\apps\frontend-theme-1975-london\frontend-theme-1975-london\node_modules\fsevents\node_modules\console-control-strings' -> 'C:\opt\dev\projects\github\liferay-portal-7.0.x-private\modules\apps\frontend-theme-1975-london\frontend-theme-1975-london\node_modules\fsevents\node_modules\.console-control-strings.DELETE'
      npm WARN optional SKIPPING OPTIONAL DEPENDENCY: core-util-is@1.0.2 (node_modules\fsevents\node_modules\core-util-is):
      npm WARN enoent SKIPPING OPTIONAL DEPENDENCY: ENOENT: no such file or directory, rename 'C:\opt\dev\projects\github\liferay-portal-7.0.x-private\modules\apps\frontend-theme-1975-london\frontend-theme-1975-london\node_modules\fsevents\node_modules\core-util-is' -> 'C:\opt\dev\projects\github\liferay-portal-7.0.x-private\modules\apps\frontend-theme-1975-london\frontend-theme-1975-london\node_modules\fsevents\node_modules\.core-util-is.DELETE'
      npm WARN optional SKIPPING OPTIONAL DEPENDENCY: assert-plus@1.0.0 (node_modules\fsevents\node_modules\dashdash\node_modules\assert-plus):
      npm WARN enoent SKIPPING OPTIONAL DEPENDENCY: ENOENT: no such file or directory, rename 'C:\opt\dev\projects\github\liferay-portal-7.0.x-private\modules\apps\frontend-theme-1975-london\frontend-theme-1975-london\node_modules\fsevents\node_modules\dashdash\node_modules\assert-plus' -> 'C:\opt\dev\projects\github\liferay-portal-7.0.x-private\modules\apps\frontend-theme-1975-london\frontend-theme-1975-london\node_modules\fsevents\node_modules\dashdash\node_modules\.assert-plus.DELETE'
      npm WARN optional SKIPPING OPTIONAL DEPENDENCY: deep-extend@0.4.2 (node_modules\fsevents\node_modules\deep-extend):
      npm WARN enoent SKIPPING OPTIONAL DEPENDENCY: ENOENT: no such file or directory, rename 'C:\opt\dev\projects\github\liferay-portal-7.0.x-private\modules\apps\frontend-theme-1975-london\frontend-theme-1975-london\node_modules\fsevents\node_modules\deep-extend' -> 'C:\opt\dev\projects\github\liferay-portal-7.0.x-private\modules\apps\frontend-theme-1975-london\frontend-theme-1975-london\node_modules\fsevents\node_modules\.deep-extend.DELETE'
      npm WARN optional SKIPPING OPTIONAL DEPENDENCY: delayed-stream@1.0.0 (node_modules\fsevents\node_modules\delayed-stream):
      npm WARN enoent SKIPPING OPTIONAL DEPENDENCY: ENOENT: no such file or directory, rename 'C:\opt\dev\projects\github\liferay-portal-7.0.x-private\modules\apps\frontend-theme-1975-london\frontend-theme-1975-london\node_modules\fsevents\node_modules\delayed-stream' -> 'C:\opt\dev\projects\github\liferay-portal-7.0.x-private\modules\apps\frontend-theme-1975-london\frontend-theme-1975-london\node_modules\fsevents\node_modules\.delayed-stream.DELETE'
      npm WARN optional SKIPPING OPTIONAL DEPENDENCY: delegates@1.0.0 (node_modules\fsevents\node_modules\delegates):
      npm WARN enoent SKIPPING OPTIONAL DEPENDENCY: ENOENT: no such file or directory, rename 'C:\opt\dev\projects\github\liferay-portal-7.0.x-private\modules\apps\frontend-theme-1975-london\frontend-theme-1975-london\node_modules\fsevents\node_modules\delegates' -> 'C:\opt\dev\projects\github\liferay-portal-7.0.x-private\modules\apps\frontend-theme-1975-london\frontend-theme-1975-london\node_modules\fsevents\node_modules\.delegates.DELETE'
      npm WARN optional SKIPPING OPTIONAL DEPENDENCY: detect-libc@1.0.2 (node_modules\fsevents\node_modules\detect-libc):
      npm WARN enoent SKIPPING OPTIONAL DEPENDENCY: ENOENT: no such file or directory, rename 'C:\opt\dev\projects\github\liferay-portal-7.0.x-private\modules\apps\frontend-theme-1975-london\frontend-theme-1975-london\node_modules\fsevents\node_modules\detect-libc' -> 'C:\opt\dev\projects\github\liferay-portal-7.0.x-private\modules\apps\frontend-theme-1975-london\frontend-theme-1975-london\node_modules\fsevents\node_modules\.detect-libc.DELETE'
      npm WARN optional SKIPPING OPTIONAL DEPENDENCY: extend@3.0.1 (node_modules\fsevents\node_modules\extend):
      npm WARN enoent SKIPPING OPTIONAL DEPENDENCY: ENOENT: no such file or directory, rename 'C:\opt\dev\projects\github\liferay-portal-7.0.x-private\modules\apps\frontend-theme-1975-london\frontend-theme-1975-london\node_modules\fsevents\node_modules\extend' -> 'C:\opt\dev\projects\github\liferay-portal-7.0.x-private\modules\apps\frontend-theme-1975-london\frontend-theme-1975-london\node_modules\fsevents\node_modules\.extend.DELETE'
      npm WARN optional SKIPPING OPTIONAL DEPENDENCY: extsprintf@1.0.2 (node_modules\fsevents\node_modules\extsprintf):
      npm WARN enoent SKIPPING OPTIONAL DEPENDENCY: ENOENT: no such file or directory, rename 'C:\opt\dev\projects\github\liferay-portal-7.0.x-private\modules\apps\frontend-theme-1975-london\frontend-theme-1975-london\node_modules\fsevents\node_modules\extsprintf' -> 'C:\opt\dev\projects\github\liferay-portal-7.0.x-private\modules\apps\frontend-theme-1975-london\frontend-theme-1975-london\node_modules\fsevents\node_modules\.extsprintf.DELETE'
      npm WARN optional SKIPPING OPTIONAL DEPENDENCY: forever-agent@0.6.1 (node_modules\fsevents\node_modules\forever-agent):
      npm WARN enoent SKIPPING OPTIONAL DEPENDENCY: ENOENT: no such file or directory, rename 'C:\opt\dev\projects\github\liferay-portal-7.0.x-private\modules\apps\frontend-theme-1975-london\frontend-theme-1975-london\node_modules\fsevents\node_modules\forever-agent' -> 'C:\opt\dev\projects\github\liferay-portal-7.0.x-private\modules\apps\frontend-theme-1975-london\frontend-theme-1975-london\node_modules\fsevents\node_modules\.forever-agent.DELETE'
      npm WARN optional SKIPPING OPTIONAL DEPENDENCY: fs.realpath@1.0.0 (node_modules\fsevents\node_modules\fs.realpath):
      npm WARN enoent SKIPPING OPTIONAL DEPENDENCY: ENOENT: no such file or directory, rename 'C:\opt\dev\projects\github\liferay-portal-7.0.x-private\modules\apps\frontend-theme-1975-london\frontend-theme-1975-london\node_modules\fsevents\node_modules\fs.realpath' -> 'C:\opt\dev\projects\github\liferay-portal-7.0.x-private\modules\apps\frontend-theme-1975-london\frontend-theme-1975-london\node_modules\fsevents\node_modules\.fs.realpath.DELETE'
      npm WARN optional SKIPPING OPTIONAL DEPENDENCY: assert-plus@1.0.0 (node_modules\fsevents\node_modules\getpass\node_modules\assert-plus):
      npm WARN enoent SKIPPING OPTIONAL DEPENDENCY: ENOENT: no such file or directory, rename 'C:\opt\dev\projects\github\liferay-portal-7.0.x-private\modules\apps\frontend-theme-1975-london\frontend-theme-1975-london\node_modules\fsevents\node_modules\getpass\node_modules\assert-plus' -> 'C:\opt\dev\projects\github\liferay-portal-7.0.x-private\modules\apps\frontend-theme-1975-london\frontend-theme-1975-london\node_modules\fsevents\node_modules\getpass\node_modules\.assert-plus.DELETE'
      npm WARN optional SKIPPING OPTIONAL DEPENDENCY: graceful-fs@4.1.11 (node_modules\fsevents\node_modules\graceful-fs):
      npm WARN enoent SKIPPING OPTIONAL DEPENDENCY: ENOENT: no such file or directory, rename 'C:\opt\dev\projects\github\liferay-portal-7.0.x-private\modules\apps\frontend-theme-1975-london\frontend-theme-1975-london\node_modules\fsevents\node_modules\graceful-fs' -> 'C:\opt\dev\projects\github\liferay-portal-7.0.x-private\modules\apps\frontend-theme-1975-london\frontend-theme-1975-london\node_modules\fsevents\node_modules\.graceful-fs.DELETE'
      npm WARN optional SKIPPING OPTIONAL DEPENDENCY: har-schema@1.0.5 (node_modules\fsevents\node_modules\har-schema):
      npm WARN enoent SKIPPING OPTIONAL DEPENDENCY: ENOENT: no such file or directory, rename 'C:\opt\dev\projects\github\liferay-portal-7.0.x-private\modules\apps\frontend-theme-1975-london\frontend-theme-1975-london\node_modules\fsevents\node_modules\har-schema' -> 'C:\opt\dev\projects\github\liferay-portal-7.0.x-private\modules\apps\frontend-theme-1975-london\frontend-theme-1975-london\node_modules\fsevents\node_modules\.har-schema.DELETE'
      npm WARN optional SKIPPING OPTIONAL DEPENDENCY: has-unicode@2.0.1 (node_modules\fsevents\node_modules\has-unicode):
      npm WARN enoent SKIPPING OPTIONAL DEPENDENCY: ENOENT: no such file or directory, rename 'C:\opt\dev\projects\github\liferay-portal-7.0.x-private\modules\apps\frontend-theme-1975-london\frontend-theme-1975-london\node_modules\fsevents\node_modules\has-unicode' -> 'C:\opt\dev\projects\github\liferay-portal-7.0.x-private\modules\apps\frontend-theme-1975-london\frontend-theme-1975-london\node_modules\fsevents\node_modules\.has-unicode.DELETE'
      npm WARN optional SKIPPING OPTIONAL DEPENDENCY: hoek@2.16.3 (node_modules\fsevents\node_modules\hoek):
      npm WARN enoent SKIPPING OPTIONAL DEPENDENCY: ENOENT: no such file or directory, rename 'C:\opt\dev\projects\github\liferay-portal-7.0.x-private\modules\apps\frontend-theme-1975-london\frontend-theme-1975-london\node_modules\fsevents\node_modules\hoek' -> 'C:\opt\dev\projects\github\liferay-portal-7.0.x-private\modules\apps\frontend-theme-1975-london\frontend-theme-1975-london\node_modules\fsevents\node_modules\.hoek.DELETE'
      npm WARN optional SKIPPING OPTIONAL DEPENDENCY: inherits@2.0.3 (node_modules\fsevents\node_modules\inherits):
      npm WARN enoent SKIPPING OPTIONAL DEPENDENCY: ENOENT: no such file or directory, rename 'C:\opt\dev\projects\github\liferay-portal-7.0.x-private\modules\apps\frontend-theme-1975-london\frontend-theme-1975-london\node_modules\fsevents\node_modules\inherits' -> 'C:\opt\dev\projects\github\liferay-portal-7.0.x-private\modules\apps\frontend-theme-1975-london\frontend-theme-1975-london\node_modules\fsevents\node_modules\.inherits.DELETE'
      npm WARN optional SKIPPING OPTIONAL DEPENDENCY: ini@1.3.4 (node_modules\fsevents\node_modules\ini):
      npm WARN enoent SKIPPING OPTIONAL DEPENDENCY: ENOENT: no such file or directory, rename 'C:\opt\dev\projects\github\liferay-portal-7.0.x-private\modules\apps\frontend-theme-1975-london\frontend-theme-1975-london\node_modules\fsevents\node_modules\ini' -> 'C:\opt\dev\projects\github\liferay-portal-7.0.x-private\modules\apps\frontend-theme-1975-london\frontend-theme-1975-london\node_modules\fsevents\node_modules\.ini.DELETE'
      npm WARN optional SKIPPING OPTIONAL DEPENDENCY: is-typedarray@1.0.0 (node_modules\fsevents\node_modules\is-typedarray):
      npm WARN enoent SKIPPING OPTIONAL DEPENDENCY: ENOENT: no such file or directory, rename 'C:\opt\dev\projects\github\liferay-portal-7.0.x-private\modules\apps\frontend-theme-1975-london\frontend-theme-1975-london\node_modules\fsevents\node_modules\is-typedarray' -> 'C:\opt\dev\projects\github\liferay-portal-7.0.x-private\modules\apps\frontend-theme-1975-london\frontend-theme-1975-london\node_modules\fsevents\node_modules\.is-typedarray.DELETE'
      npm WARN optional SKIPPING OPTIONAL DEPENDENCY: isarray@1.0.0 (node_modules\fsevents\node_modules\isarray):
      npm WARN enoent SKIPPING OPTIONAL DEPENDENCY: ENOENT: no such file or directory, rename 'C:\opt\dev\projects\github\liferay-portal-7.0.x-private\modules\apps\frontend-theme-1975-london\frontend-theme-1975-london\node_modules\fsevents\node_modules\isarray' -> 'C:\opt\dev\projects\github\liferay-portal-7.0.x-private\modules\apps\frontend-theme-1975-london\frontend-theme-1975-london\node_modules\fsevents\node_modules\.isarray.DELETE'
      npm WARN optional SKIPPING OPTIONAL DEPENDENCY: isstream@0.1.2 (node_modules\fsevents\node_modules\isstream):
      npm WARN enoent SKIPPING OPTIONAL DEPENDENCY: ENOENT: no such file or directory, rename 'C:\opt\dev\projects\github\liferay-portal-7.0.x-private\modules\apps\frontend-theme-1975-london\frontend-theme-1975-london\node_modules\fsevents\node_modules\isstream' -> 'C:\opt\dev\projects\github\liferay-portal-7.0.x-private\modules\apps\frontend-theme-1975-london\frontend-theme-1975-london\node_modules\fsevents\node_modules\.isstream.DELETE'
      npm WARN optional SKIPPING OPTIONAL DEPENDENCY: jsbn@0.1.1 (node_modules\fsevents\node_modules\jsbn):
      npm WARN enoent SKIPPING OPTIONAL DEPENDENCY: ENOENT: no such file or directory, rename 'C:\opt\dev\projects\github\liferay-portal-7.0.x-private\modules\apps\frontend-theme-1975-london\frontend-theme-1975-london\node_modules\fsevents\node_modules\jsbn' -> 'C:\opt\dev\projects\github\liferay-portal-7.0.x-private\modules\apps\frontend-theme-1975-london\frontend-theme-1975-london\node_modules\fsevents\node_modules\.jsbn.DELETE'
      npm WARN optional SKIPPING OPTIONAL DEPENDENCY: ecc-jsbn@0.1.1 (node_modules\fsevents\node_modules\ecc-jsbn):
      npm WARN enoent SKIPPING OPTIONAL DEPENDENCY: ENOENT: no such file or directory, rename 'C:\opt\dev\projects\github\liferay-portal-7.0.x-private\modules\apps\frontend-theme-1975-london\frontend-theme-1975-london\node_modules\fsevents\node_modules\ecc-jsbn' -> 'C:\opt\dev\projects\github\liferay-portal-7.0.x-private\modules\apps\frontend-theme-1975-london\frontend-theme-1975-london\node_modules\fsevents\node_modules\.ecc-jsbn.DELETE'
      npm WARN optional SKIPPING OPTIONAL DEPENDENCY: jodid25519@1.0.2 (node_modules\fsevents\node_modules\jodid25519):
      npm WARN enoent SKIPPING OPTIONAL DEPENDENCY: ENOENT: no such file or directory, rename 'C:\opt\dev\projects\github\liferay-portal-7.0.x-private\modules\apps\frontend-theme-1975-london\frontend-theme-1975-london\node_modules\fsevents\node_modules\jodid25519' -> 'C:\opt\dev\projects\github\liferay-portal-7.0.x-private\modules\apps\frontend-theme-1975-london\frontend-theme-1975-london\node_modules\fsevents\node_modules\.jodid25519.DELETE'
      npm WARN optional SKIPPING OPTIONAL DEPENDENCY: json-schema@0.2.3 (node_modules\fsevents\node_modules\json-schema):
      npm WARN enoent SKIPPING OPTIONAL DEPENDENCY: ENOENT: no such file or directory, rename 'C:\opt\dev\projects\github\liferay-portal-7.0.x-private\modules\apps\frontend-theme-1975-london\frontend-theme-1975-london\node_modules\fsevents\node_modules\json-schema' -> 'C:\opt\dev\projects\github\liferay-portal-7.0.x-private\modules\apps\frontend-theme-1975-london\frontend-theme-1975-london\node_modules\fsevents\node_modules\.json-schema.DELETE'
      npm WARN optional SKIPPING OPTIONAL DEPENDENCY: json-stringify-safe@5.0.1 (node_modules\fsevents\node_modules\json-stringify-safe):
      npm WARN enoent SKIPPING OPTIONAL DEPENDENCY: ENOENT: no such file or directory, rename 'C:\opt\dev\projects\github\liferay-portal-7.0.x-private\modules\apps\frontend-theme-1975-london\frontend-theme-1975-london\node_modules\fsevents\node_modules\json-stringify-safe' -> 'C:\opt\dev\projects\github\liferay-portal-7.0.x-private\modules\apps\frontend-theme-1975-london\frontend-theme-1975-london\node_modules\fsevents\node_modules\.json-stringify-safe.DELETE'
      npm WARN optional SKIPPING OPTIONAL DEPENDENCY: jsonify@0.0.0 (node_modules\fsevents\node_modules\jsonify):
      npm WARN enoent SKIPPING OPTIONAL DEPENDENCY: ENOENT: no such file or directory, rename 'C:\opt\dev\projects\github\liferay-portal-7.0.x-private\modules\apps\frontend-theme-1975-london\frontend-theme-1975-london\node_modules\fsevents\node_modules\jsonify' -> 'C:\opt\dev\projects\github\liferay-portal-7.0.x-private\modules\apps\frontend-theme-1975-london\frontend-theme-1975-london\node_modules\fsevents\node_modules\.jsonify.DELETE'
      npm WARN optional SKIPPING OPTIONAL DEPENDENCY: assert-plus@1.0.0 (node_modules\fsevents\node_modules\jsprim\node_modules\assert-plus):
      npm WARN enoent SKIPPING OPTIONAL DEPENDENCY: ENOENT: no such file or directory, rename 'C:\opt\dev\projects\github\liferay-portal-7.0.x-private\modules\apps\frontend-theme-1975-london\frontend-theme-1975-london\node_modules\fsevents\node_modules\jsprim\node_modules\assert-plus' -> 'C:\opt\dev\projects\github\liferay-portal-7.0.x-private\modules\apps\frontend-theme-1975-london\frontend-theme-1975-london\node_modules\fsevents\node_modules\jsprim\node_modules\.assert-plus.DELETE'
      npm WARN optional SKIPPING OPTIONAL DEPENDENCY: mime-db@1.27.0 (node_modules\fsevents\node_modules\mime-db):
      npm WARN enoent SKIPPING OPTIONAL DEPENDENCY: ENOENT: no such file or directory, rename 'C:\opt\dev\projects\github\liferay-portal-7.0.x-private\modules\apps\frontend-theme-1975-london\frontend-theme-1975-london\node_modules\fsevents\node_modules\mime-db' -> 'C:\opt\dev\projects\github\liferay-portal-7.0.x-private\modules\apps\frontend-theme-1975-london\frontend-theme-1975-london\node_modules\fsevents\node_modules\.mime-db.DELETE'
      npm WARN optional SKIPPING OPTIONAL DEPENDENCY: minimist@0.0.8 (node_modules\fsevents\node_modules\minimist):
      npm WARN enoent SKIPPING OPTIONAL DEPENDENCY: ENOENT: no such file or directory, rename 'C:\opt\dev\projects\github\liferay-portal-7.0.x-private\modules\apps\frontend-theme-1975-london\frontend-theme-1975-london\node_modules\fsevents\node_modules\minimist' -> 'C:\opt\dev\projects\github\liferay-portal-7.0.x-private\modules\apps\frontend-theme-1975-london\frontend-theme-1975-london\node_modules\fsevents\node_modules\.minimist.DELETE'
      npm WARN optional SKIPPING OPTIONAL DEPENDENCY: ms@2.0.0 (node_modules\fsevents\node_modules\ms):
      npm WARN enoent SKIPPING OPTIONAL DEPENDENCY: ENOENT: no such file or directory, rename 'C:\opt\dev\projects\github\liferay-portal-7.0.x-private\modules\apps\frontend-theme-1975-london\frontend-theme-1975-london\node_modules\fsevents\node_modules\ms' -> 'C:\opt\dev\projects\github\liferay-portal-7.0.x-private\modules\apps\frontend-theme-1975-london\frontend-theme-1975-london\node_modules\fsevents\node_modules\.ms.DELETE'
      npm WARN optional SKIPPING OPTIONAL DEPENDENCY: number-is-nan@1.0.1 (node_modules\fsevents\node_modules\number-is-nan):
      npm WARN enoent SKIPPING OPTIONAL DEPENDENCY: ENOENT: no such file or directory, rename 'C:\opt\dev\projects\github\liferay-portal-7.0.x-private\modules\apps\frontend-theme-1975-london\frontend-theme-1975-london\node_modules\fsevents\node_modules\number-is-nan' -> 'C:\opt\dev\projects\github\liferay-portal-7.0.x-private\modules\apps\frontend-theme-1975-london\frontend-theme-1975-london\node_modules\fsevents\node_modules\.number-is-nan.DELETE'
      npm WARN optional SKIPPING OPTIONAL DEPENDENCY: oauth-sign@0.8.2 (node_modules\fsevents\node_modules\oauth-sign):
      npm WARN enoent SKIPPING OPTIONAL DEPENDENCY: ENOENT: no such file or directory, rename 'C:\opt\dev\projects\github\liferay-portal-7.0.x-private\modules\apps\frontend-theme-1975-london\frontend-theme-1975-london\node_modules\fsevents\node_modules\oauth-sign' -> 'C:\opt\dev\projects\github\liferay-portal-7.0.x-private\modules\apps\frontend-theme-1975-london\frontend-theme-1975-london\node_modules\fsevents\node_modules\.oauth-sign.DELETE'
      npm WARN optional SKIPPING OPTIONAL DEPENDENCY: object-assign@4.1.1 (node_modules\fsevents\node_modules\object-assign):
      npm WARN enoent SKIPPING OPTIONAL DEPENDENCY: ENOENT: no such file or directory, rename 'C:\opt\dev\projects\github\liferay-portal-7.0.x-private\modules\apps\frontend-theme-1975-london\frontend-theme-1975-london\node_modules\fsevents\node_modules\object-assign' -> 'C:\opt\dev\projects\github\liferay-portal-7.0.x-private\modules\apps\frontend-theme-1975-london\frontend-theme-1975-london\node_modules\fsevents\node_modules\.object-assign.DELETE'
      npm WARN optional SKIPPING OPTIONAL DEPENDENCY: os-homedir@1.0.2 (node_modules\fsevents\node_modules\os-homedir):
      npm WARN enoent SKIPPING OPTIONAL DEPENDENCY: ENOENT: no such file or directory, rename 'C:\opt\dev\projects\github\liferay-portal-7.0.x-private\modules\apps\frontend-theme-1975-london\frontend-theme-1975-london\node_modules\fsevents\node_modules\os-homedir' -> 'C:\opt\dev\projects\github\liferay-portal-7.0.x-private\modules\apps\frontend-theme-1975-london\frontend-theme-1975-london\node_modules\fsevents\node_modules\.os-homedir.DELETE'
      npm WARN optional SKIPPING OPTIONAL DEPENDENCY: os-tmpdir@1.0.2 (node_modules\fsevents\node_modules\os-tmpdir):
      npm WARN enoent SKIPPING OPTIONAL DEPENDENCY: ENOENT: no such file or directory, rename 'C:\opt\dev\projects\github\liferay-portal-7.0.x-private\modules\apps\frontend-theme-1975-london\frontend-theme-1975-london\node_modules\fsevents\node_modules\os-tmpdir' -> 'C:\opt\dev\projects\github\liferay-portal-7.0.x-private\modules\apps\frontend-theme-1975-london\frontend-theme-1975-london\node_modules\fsevents\node_modules\.os-tmpdir.DELETE'
      npm WARN optional SKIPPING OPTIONAL DEPENDENCY: path-is-absolute@1.0.1 (node_modules\fsevents\node_modules\path-is-absolute):
      npm WARN enoent SKIPPING OPTIONAL DEPENDENCY: ENOENT: no such file or directory, rename 'C:\opt\dev\projects\github\liferay-portal-7.0.x-private\modules\apps\frontend-theme-1975-london\frontend-theme-1975-london\node_modules\fsevents\node_modules\path-is-absolute' -> 'C:\opt\dev\projects\github\liferay-portal-7.0.x-private\modules\apps\frontend-theme-1975-london\frontend-theme-1975-london\node_modules\fsevents\node_modules\.path-is-absolute.DELETE'
      npm WARN optional SKIPPING OPTIONAL DEPENDENCY: performance-now@0.2.0 (node_modules\fsevents\node_modules\performance-now):
      npm WARN enoent SKIPPING OPTIONAL DEPENDENCY: ENOENT: no such file or directory, rename 'C:\opt\dev\projects\github\liferay-portal-7.0.x-private\modules\apps\frontend-theme-1975-london\frontend-theme-1975-london\node_modules\fsevents\node_modules\performance-now' -> 'C:\opt\dev\projects\github\liferay-portal-7.0.x-private\modules\apps\frontend-theme-1975-london\frontend-theme-1975-london\node_modules\fsevents\node_modules\.performance-now.DELETE'
      npm WARN optional SKIPPING OPTIONAL DEPENDENCY: process-nextick-args@1.0.7 (node_modules\fsevents\node_modules\process-nextick-args):
      npm WARN enoent SKIPPING OPTIONAL DEPENDENCY: ENOENT: no such file or directory, rename 'C:\opt\dev\projects\github\liferay-portal-7.0.x-private\modules\apps\frontend-theme-1975-london\frontend-theme-1975-london\node_modules\fsevents\node_modules\process-nextick-args' -> 'C:\opt\dev\projects\github\liferay-portal-7.0.x-private\modules\apps\frontend-theme-1975-london\frontend-theme-1975-london\node_modules\fsevents\node_modules\.process-nextick-args.DELETE'
      npm WARN optional SKIPPING OPTIONAL DEPENDENCY: punycode@1.4.1 (node_modules\fsevents\node_modules\punycode):
      npm WARN enoent SKIPPING OPTIONAL DEPENDENCY: ENOENT: no such file or directory, rename 'C:\opt\dev\projects\github\liferay-portal-7.0.x-private\modules\apps\frontend-theme-1975-london\frontend-theme-1975-london\node_modules\fsevents\node_modules\punycode' -> 'C:\opt\dev\projects\github\liferay-portal-7.0.x-private\modules\apps\frontend-theme-1975-london\frontend-theme-1975-london\node_modules\fsevents\node_modules\.punycode.DELETE'
      npm WARN optional SKIPPING OPTIONAL DEPENDENCY: qs@6.4.0 (node_modules\fsevents\node_modules\qs):
      npm WARN enoent SKIPPING OPTIONAL DEPENDENCY: ENOENT: no such file or directory, rename 'C:\opt\dev\projects\github\liferay-portal-7.0.x-private\modules\apps\frontend-theme-1975-london\frontend-theme-1975-london\node_modules\fsevents\node_modules\qs' -> 'C:\opt\dev\projects\github\liferay-portal-7.0.x-private\modules\apps\frontend-theme-1975-london\frontend-theme-1975-london\node_modules\fsevents\node_modules\.qs.DELETE'
      npm WARN optional SKIPPING OPTIONAL DEPENDENCY: minimist@1.2.0 (node_modules\fsevents\node_modules\rc\node_modules\minimist):
      npm WARN enoent SKIPPING OPTIONAL DEPENDENCY: ENOENT: no such file or directory, rename 'C:\opt\dev\projects\github\liferay-portal-7.0.x-private\modules\apps\frontend-theme-1975-london\frontend-theme-1975-london\node_modules\fsevents\node_modules\rc\node_modules\minimist' -> 'C:\opt\dev\projects\github\liferay-portal-7.0.x-private\modules\apps\frontend-theme-1975-london\frontend-theme-1975-london\node_modules\fsevents\node_modules\rc\node_modules\.minimist.DELETE'
      npm WARN optional SKIPPING OPTIONAL DEPENDENCY: safe-buffer@5.0.1 (node_modules\fsevents\node_modules\safe-buffer):
      npm WARN enoent SKIPPING OPTIONAL DEPENDENCY: ENOENT: no such file or directory, rename 'C:\opt\dev\projects\github\liferay-portal-7.0.x-private\modules\apps\frontend-theme-1975-london\frontend-theme-1975-london\node_modules\fsevents\node_modules\safe-buffer' -> 'C:\opt\dev\projects\github\liferay-portal-7.0.x-private\modules\apps\frontend-theme-1975-london\frontend-theme-1975-london\node_modules\fsevents\node_modules\.safe-buffer.DELETE'
      npm WARN optional SKIPPING OPTIONAL DEPENDENCY: semver@5.3.0 (node_modules\fsevents\node_modules\semver):
      npm WARN enoent SKIPPING OPTIONAL DEPENDENCY: ENOENT: no such file or directory, rename 'C:\opt\dev\projects\github\liferay-portal-7.0.x-private\modules\apps\frontend-theme-1975-london\frontend-theme-1975-london\node_modules\fsevents\node_modules\semver' -> 'C:\opt\dev\projects\github\liferay-portal-7.0.x-private\modules\apps\frontend-theme-1975-london\frontend-theme-1975-london\node_modules\fsevents\node_modules\.semver.DELETE'
      npm WARN optional SKIPPING OPTIONAL DEPENDENCY: set-blocking@2.0.0 (node_modules\fsevents\node_modules\set-blocking):
      npm WARN enoent SKIPPING OPTIONAL DEPENDENCY: ENOENT: no such file or directory, rename 'C:\opt\dev\projects\github\liferay-portal-7.0.x-private\modules\apps\frontend-theme-1975-london\frontend-theme-1975-london\node_modules\fsevents\node_modules\set-blocking' -> 'C:\opt\dev\projects\github\liferay-portal-7.0.x-private\modules\apps\frontend-theme-1975-london\frontend-theme-1975-london\node_modules\fsevents\node_modules\.set-blocking.DELETE'
      npm WARN optional SKIPPING OPTIONAL DEPENDENCY: signal-exit@3.0.2 (node_modules\fsevents\node_modules\signal-exit):
      npm WARN enoent SKIPPING OPTIONAL DEPENDENCY: ENOENT: no such file or directory, rename 'C:\opt\dev\projects\github\liferay-portal-7.0.x-private\modules\apps\frontend-theme-1975-london\frontend-theme-1975-london\node_modules\fsevents\node_modules\signal-exit' -> 'C:\opt\dev\projects\github\liferay-portal-7.0.x-private\modules\apps\frontend-theme-1975-london\frontend-theme-1975-london\node_modules\fsevents\node_modules\.signal-exit.DELETE'
      npm WARN optional SKIPPING OPTIONAL DEPENDENCY: assert-plus@1.0.0 (node_modules\fsevents\node_modules\sshpk\node_modules\assert-plus):
      npm WARN enoent SKIPPING OPTIONAL DEPENDENCY: ENOENT: no such file or directory, rename 'C:\opt\dev\projects\github\liferay-portal-7.0.x-private\modules\apps\frontend-theme-1975-london\frontend-theme-1975-london\node_modules\fsevents\node_modules\sshpk\node_modules\assert-plus' -> 'C:\opt\dev\projects\github\liferay-portal-7.0.x-private\modules\apps\frontend-theme-1975-london\frontend-theme-1975-london\node_modules\fsevents\node_modules\sshpk\node_modules\.assert-plus.DELETE'
      npm WARN optional SKIPPING OPTIONAL DEPENDENCY: stringstream@0.0.5 (node_modules\fsevents\node_modules\stringstream):
      npm WARN enoent SKIPPING OPTIONAL DEPENDENCY: ENOENT: no such file or directory, rename 'C:\opt\dev\projects\github\liferay-portal-7.0.x-private\modules\apps\frontend-theme-1975-london\frontend-theme-1975-london\node_modules\fsevents\node_modules\stringstream' -> 'C:\opt\dev\projects\github\liferay-portal-7.0.x-private\modules\apps\frontend-theme-1975-london\frontend-theme-1975-london\node_modules\fsevents\node_modules\.stringstream.DELETE'
      npm WARN optional SKIPPING OPTIONAL DEPENDENCY: strip-json-comments@2.0.1 (node_modules\fsevents\node_modules\strip-json-comments):
      npm WARN enoent SKIPPING OPTIONAL DEPENDENCY: ENOENT: no such file or directory, rename 'C:\opt\dev\projects\github\liferay-portal-7.0.x-private\modules\apps\frontend-theme-1975-london\frontend-theme-1975-london\node_modules\fsevents\node_modules\strip-json-comments' -> 'C:\opt\dev\projects\github\liferay-portal-7.0.x-private\modules\apps\frontend-theme-1975-london\frontend-theme-1975-london\node_modules\fsevents\node_modules\.strip-json-comments.DELETE'
      npm WARN optional SKIPPING OPTIONAL DEPENDENCY: tweetnacl@0.14.5 (node_modules\fsevents\node_modules\tweetnacl):
      npm WARN enoent SKIPPING OPTIONAL DEPENDENCY: ENOENT: no such file or directory, rename 'C:\opt\dev\projects\github\liferay-portal-7.0.x-private\modules\apps\frontend-theme-1975-london\frontend-theme-1975-london\node_modules\fsevents\node_modules\tweetnacl' -> 'C:\opt\dev\projects\github\liferay-portal-7.0.x-private\modules\apps\frontend-theme-1975-london\frontend-theme-1975-london\node_modules\fsevents\node_modules\.tweetnacl.DELETE'
      npm WARN optional SKIPPING OPTIONAL DEPENDENCY: bcrypt-pbkdf@1.0.1 (node_modules\fsevents\node_modules\bcrypt-pbkdf):
      npm WARN enoent SKIPPING OPTIONAL DEPENDENCY: ENOENT: no such file or directory, rename 'C:\opt\dev\projects\github\liferay-portal-7.0.x-private\modules\apps\frontend-theme-1975-london\frontend-theme-1975-london\node_modules\fsevents\node_modules\bcrypt-pbkdf' -> 'C:\opt\dev\projects\github\liferay-portal-7.0.x-private\modules\apps\frontend-theme-1975-london\frontend-theme-1975-london\node_modules\fsevents\node_modules\.bcrypt-pbkdf.DELETE'
      npm WARN optional SKIPPING OPTIONAL DEPENDENCY: uid-number@0.0.6 (node_modules\fsevents\node_modules\uid-number):
      npm WARN enoent SKIPPING OPTIONAL DEPENDENCY: ENOENT: no such file or directory, rename 'C:\opt\dev\projects\github\liferay-portal-7.0.x-private\modules\apps\frontend-theme-1975-london\frontend-theme-1975-london\node_modules\fsevents\node_modules\uid-number' -> 'C:\opt\dev\projects\github\liferay-portal-7.0.x-private\modules\apps\frontend-theme-1975-london\frontend-theme-1975-london\node_modules\fsevents\node_modules\.uid-number.DELETE'
      npm WARN optional SKIPPING OPTIONAL DEPENDENCY: util-deprecate@1.0.2 (node_modules\fsevents\node_modules\util-deprecate):
      npm WARN enoent SKIPPING OPTIONAL DEPENDENCY: ENOENT: no such file or directory, rename 'C:\opt\dev\projects\github\liferay-portal-7.0.x-private\modules\apps\frontend-theme-1975-london\frontend-theme-1975-london\node_modules\fsevents\node_modules\util-deprecate' -> 'C:\opt\dev\projects\github\liferay-portal-7.0.x-private\modules\apps\frontend-theme-1975-london\frontend-theme-1975-london\node_modules\fsevents\node_modules\.util-deprecate.DELETE'
      npm WARN optional SKIPPING OPTIONAL DEPENDENCY: uuid@3.0.1 (node_modules\fsevents\node_modules\uuid):
      npm WARN enoent SKIPPING OPTIONAL DEPENDENCY: ENOENT: no such file or directory, rename 'C:\opt\dev\projects\github\liferay-portal-7.0.x-private\modules\apps\frontend-theme-1975-london\frontend-theme-1975-london\node_modules\fsevents\node_modules\uuid' -> 'C:\opt\dev\projects\github\liferay-portal-7.0.x-private\modules\apps\frontend-theme-1975-london\frontend-theme-1975-london\node_modules\fsevents\node_modules\.uuid.DELETE'
      npm WARN optional SKIPPING OPTIONAL DEPENDENCY: wrappy@1.0.2 (node_modules\fsevents\node_modules\wrappy):
      npm WARN enoent SKIPPING OPTIONAL DEPENDENCY: ENOENT: no such file or directory, rename 'C:\opt\dev\projects\github\liferay-portal-7.0.x-private\modules\apps\frontend-theme-1975-london\frontend-theme-1975-london\node_modules\fsevents\node_modules\wrappy' -> 'C:\opt\dev\projects\github\liferay-portal-7.0.x-private\modules\apps\frontend-theme-1975-london\frontend-theme-1975-london\node_modules\fsevents\node_modules\.wrappy.DELETE'
      
      npm ERR! code ELIFECYCLE
      npm ERR! errno 1
      npm ERR! coffee-script@1.12.8 postinstall: `node --eval 'if (require("./package.json").name === "coffee-script") { var red, yellow, cyan, reset; red = yellow = cyan = reset = ""; if (!process.env.NODE_DISABLE_COLORS) { red = "\x1b[31m"; yellow = "\x1b[33m"; cyan = "\x1b[36m"; reset = "\x1b[0m"; } console.warn(red + "CoffeeScript has moved!" + reset + " Please update references to " + yellow + "\"coffee-script\"" + reset + " to use " + yellow + "\"coffeescript\"" + reset + " (no hyphen) instead."); console.warn("Also, a new major version has been released under the " + yellow + "coffeescript" + reset + " name on NPM. This new release targets modern JavaScript, with minimal breaking changes. Learn more at " + cyan + "http://coffeescript.org" + reset + "."); console.warn(""); }'`
      npm ERR! Exit status 1
      npm ERR! 
      npm ERR! Failed at the coffee-script@1.12.8 postinstall script.
      npm ERR! This is probably not a problem with npm. There is likely additional logging output above.
      
      npm ERR! A complete log of this run can be found in:
      npm ERR!     C:\Users\Administrator\AppData\Roaming\npm-cache\_logs\2018-03-30T20_39_40_907Z-debug.log
      Process '[cmd, /c, ""C:\opt\dev\projects\github\liferay-portal-7.0.x-private\modules\apps\frontend-theme-1975-london\frontend-theme-1975-london\build_gradle\node\node" "C:/opt/dev/projects/github/liferay-portal-7.0.x-private/modules/apps/frontend-theme-1975-london/frontend-theme-1975-london/build_gradle/node/node_modules/npm/bin/npm-cli.js" "--loglevel" "warn" "--progress" "true" "--registry" "http://mirrors.lax.liferay.com:4873" "install""]' finished with non-zero exit value 1. Running "npm install" again
      npm WARN deprecated minimatch@2.0.10: Please update to minimatch 3.0.2 or higher to avoid a RegExp DoS issue
      npm WARN deprecated minimatch@0.2.14: Please update to minimatch 3.0.2 or higher to avoid a RegExp DoS issue
      npm WARN deprecated graceful-fs@1.2.3: graceful-fs v3.0.0 and before will fail on node releases >= v7.0. Please update to graceful-fs@^4.0.0 as soon as possible. Use 'npm ls graceful-fs' to find it in the tree.
      
      > node-sass@3.13.1 install C:\opt\dev\projects\github\liferay-portal-7.0.x-private\modules\apps\frontend-theme-1975-london\frontend-theme-1975-london\node_modules\gulp-metal\node_modules\node-sass
      > node scripts/install.js
      
      Cached binary found at C:\Users\Administrator\AppData\Roaming\npm-cache\node-sass\3.13.1\win32-x64-48_binding.node
      
      > node-sass@3.13.1 install C:\opt\dev\projects\github\liferay-portal-7.0.x-private\modules\apps\frontend-theme-1975-london\frontend-theme-1975-london\node_modules\node-sass
      > node scripts/install.js
      
      Cached binary found at C:\Users\Administrator\AppData\Roaming\npm-cache\node-sass\3.13.1\win32-x64-48_binding.node
      
      > liferay-theme-deps-7.0@1.0.0 install C:\opt\dev\projects\github\liferay-portal-7.0.x-private\modules\apps\frontend-theme-1975-london\frontend-theme-1975-london\node_modules\liferay-theme-deps-7.0
      > node scripts/install.js
      
      
      > coffee-script@1.12.8 postinstall C:\opt\dev\projects\github\liferay-portal-7.0.x-private\modules\apps\frontend-theme-1975-london\frontend-theme-1975-london\node_modules\coffee-script
      > node --eval 'if (require("./package.json").name === "coffee-script") { var red, yellow, cyan, reset; red = yellow = cyan = reset = ""; if (!process.env.NODE_DISABLE_COLORS) { red = "\x1b[31m"; yellow = "\x1b[33m"; cyan = "\x1b[36m"; reset = "\x1b[0m"; } console.warn(red + "CoffeeScript has moved!" + reset + " Please update references to " + yellow + "\"coffee-script\"" + reset + " to use " + yellow + "\"coffeescript\"" + reset + " (no hyphen) instead."); console.warn("Also, a new major version has been released under the " + yellow + "coffeescript" + reset + " name on NPM. This new release targets modern JavaScript, with minimal breaking changes. Learn more at " + cyan + "http://coffeescript.org" + reset + "."); console.warn(""); }'
      
      [eval]:1
      'if
      ^^^
      SyntaxError: Invalid or unexpected token
          at Object.exports.runInThisContext (vm.js:76:16)
          at Object.<anonymous> ([eval]-wrapper:6:22)
          at Module._compile (module.js:556:32)
          at bootstrap_node.js:357:29
          at _combinedTickCallback (internal/process/next_tick.js:67:7)
          at process._tickCallback (internal/process/next_tick.js:98:9)
      npm WARN optional SKIPPING OPTIONAL DEPENDENCY: fsevents@^1.0.0 (node_modules\gulp-metal\node_modules\chokidar\node_modules\fsevents):
      npm WARN notsup SKIPPING OPTIONAL DEPENDENCY: Unsupported platform for fsevents@1.1.3: wanted {"os":"darwin","arch":"any"} (current: {"os":"win32","arch":"x64"})
      npm WARN ajv-keywords@3.1.0 requires a peer of ajv@^6.0.0 but none is installed. You must install peer dependencies yourself.
      npm WARN liferay-1975-london-theme@1.0.31 No description
      npm WARN liferay-1975-london-theme@1.0.31 license should be a valid SPDX license expression
      npm WARN optional SKIPPING OPTIONAL DEPENDENCY: abbrev@1.1.0 (node_modules\fsevents\node_modules\abbrev):
      npm WARN enoent SKIPPING OPTIONAL DEPENDENCY: ENOENT: no such file or directory, rename 'C:\opt\dev\projects\github\liferay-portal-7.0.x-private\modules\apps\frontend-theme-1975-london\frontend-theme-1975-london\node_modules\fsevents\node_modules\abbrev' -> 'C:\opt\dev\projects\github\liferay-portal-7.0.x-private\modules\apps\frontend-theme-1975-london\frontend-theme-1975-london\node_modules\fsevents\node_modules\.abbrev.DELETE'
      npm WARN optional SKIPPING OPTIONAL DEPENDENCY: ansi-regex@2.1.1 (node_modules\fsevents\node_modules\ansi-regex):
      npm WARN enoent SKIPPING OPTIONAL DEPENDENCY: ENOENT: no such file or directory, rename 'C:\opt\dev\projects\github\liferay-portal-7.0.x-private\modules\apps\frontend-theme-1975-london\frontend-theme-1975-london\node_modules\fsevents\node_modules\ansi-regex' -> 'C:\opt\dev\projects\github\liferay-portal-7.0.x-private\modules\apps\frontend-theme-1975-london\frontend-theme-1975-london\node_modules\fsevents\node_modules\.ansi-regex.DELETE'
      npm WARN optional SKIPPING OPTIONAL DEPENDENCY: aproba@1.1.1 (node_modules\fsevents\node_modules\aproba):
      npm WARN enoent SKIPPING OPTIONAL DEPENDENCY: ENOENT: no such file or directory, rename 'C:\opt\dev\projects\github\liferay-portal-7.0.x-private\modules\apps\frontend-theme-1975-london\frontend-theme-1975-london\node_modules\fsevents\node_modules\aproba' -> 'C:\opt\dev\projects\github\liferay-portal-7.0.x-private\modules\apps\frontend-theme-1975-london\frontend-theme-1975-london\node_modules\fsevents\node_modules\.aproba.DELETE'
      npm WARN optional SKIPPING OPTIONAL DEPENDENCY: asn1@0.2.3 (node_modules\fsevents\node_modules\asn1):
      npm WARN enoent SKIPPING OPTIONAL DEPENDENCY: ENOENT: no such file or directory, rename 'C:\opt\dev\projects\github\liferay-portal-7.0.x-private\modules\apps\frontend-theme-1975-london\frontend-theme-1975-london\node_modules\fsevents\node_modules\asn1' -> 'C:\opt\dev\projects\github\liferay-portal-7.0.x-private\modules\apps\frontend-theme-1975-london\frontend-theme-1975-london\node_modules\fsevents\node_modules\.asn1.DELETE'
      npm WARN optional SKIPPING OPTIONAL DEPENDENCY: assert-plus@0.2.0 (node_modules\fsevents\node_modules\assert-plus):
      npm WARN enoent SKIPPING OPTIONAL DEPENDENCY: ENOENT: no such file or directory, rename 'C:\opt\dev\projects\github\liferay-portal-7.0.x-private\modules\apps\frontend-theme-1975-london\frontend-theme-1975-london\node_modules\fsevents\node_modules\assert-plus' -> 'C:\opt\dev\projects\github\liferay-portal-7.0.x-private\modules\apps\frontend-theme-1975-london\frontend-theme-1975-london\node_modules\fsevents\node_modules\.assert-plus.DELETE'
      npm WARN optional SKIPPING OPTIONAL DEPENDENCY: asynckit@0.4.0 (node_modules\fsevents\node_modules\asynckit):
      npm WARN enoent SKIPPING OPTIONAL DEPENDENCY: ENOENT: no such file or directory, rename 'C:\opt\dev\projects\github\liferay-portal-7.0.x-private\modules\apps\frontend-theme-1975-london\frontend-theme-1975-london\node_modules\fsevents\node_modules\asynckit' -> 'C:\opt\dev\projects\github\liferay-portal-7.0.x-private\modules\apps\frontend-theme-1975-london\frontend-theme-1975-london\node_modules\fsevents\node_modules\.asynckit.DELETE'
      npm WARN optional SKIPPING OPTIONAL DEPENDENCY: aws-sign2@0.6.0 (node_modules\fsevents\node_modules\aws-sign2):
      npm WARN enoent SKIPPING OPTIONAL DEPENDENCY: ENOENT: no such file or directory, rename 'C:\opt\dev\projects\github\liferay-portal-7.0.x-private\modules\apps\frontend-theme-1975-london\frontend-theme-1975-london\node_modules\fsevents\node_modules\aws-sign2' -> 'C:\opt\dev\projects\github\liferay-portal-7.0.x-private\modules\apps\frontend-theme-1975-london\frontend-theme-1975-london\node_modules\fsevents\node_modules\.aws-sign2.DELETE'
      npm WARN optional SKIPPING OPTIONAL DEPENDENCY: aws4@1.6.0 (node_modules\fsevents\node_modules\aws4):
      npm WARN enoent SKIPPING OPTIONAL DEPENDENCY: ENOENT: no such file or directory, rename 'C:\opt\dev\projects\github\liferay-portal-7.0.x-private\modules\apps\frontend-theme-1975-london\frontend-theme-1975-london\node_modules\fsevents\node_modules\aws4' -> 'C:\opt\dev\projects\github\liferay-portal-7.0.x-private\modules\apps\frontend-theme-1975-london\frontend-theme-1975-london\node_modules\fsevents\node_modules\.aws4.DELETE'
      npm WARN optional SKIPPING OPTIONAL DEPENDENCY: balanced-match@0.4.2 (node_modules\fsevents\node_modules\balanced-match):
      npm WARN enoent SKIPPING OPTIONAL DEPENDENCY: ENOENT: no such file or directory, rename 'C:\opt\dev\projects\github\liferay-portal-7.0.x-private\modules\apps\frontend-theme-1975-london\frontend-theme-1975-london\node_modules\fsevents\node_modules\balanced-match' -> 'C:\opt\dev\projects\github\liferay-portal-7.0.x-private\modules\apps\frontend-theme-1975-london\frontend-theme-1975-london\node_modules\fsevents\node_modules\.balanced-match.DELETE'
      npm WARN optional SKIPPING OPTIONAL DEPENDENCY: buffer-shims@1.0.0 (node_modules\fsevents\node_modules\buffer-shims):
      npm WARN enoent SKIPPING OPTIONAL DEPENDENCY: ENOENT: no such file or directory, rename 'C:\opt\dev\projects\github\liferay-portal-7.0.x-private\modules\apps\frontend-theme-1975-london\frontend-theme-1975-london\node_modules\fsevents\node_modules\buffer-shims' -> 'C:\opt\dev\projects\github\liferay-portal-7.0.x-private\modules\apps\frontend-theme-1975-london\frontend-theme-1975-london\node_modules\fsevents\node_modules\.buffer-shims.DELETE'
      npm WARN optional SKIPPING OPTIONAL DEPENDENCY: caseless@0.12.0 (node_modules\fsevents\node_modules\caseless):
      npm WARN enoent SKIPPING OPTIONAL DEPENDENCY: ENOENT: no such file or directory, rename 'C:\opt\dev\projects\github\liferay-portal-7.0.x-private\modules\apps\frontend-theme-1975-london\frontend-theme-1975-london\node_modules\fsevents\node_modules\caseless' -> 'C:\opt\dev\projects\github\liferay-portal-7.0.x-private\modules\apps\frontend-theme-1975-london\frontend-theme-1975-london\node_modules\fsevents\node_modules\.caseless.DELETE'
      npm WARN optional SKIPPING OPTIONAL DEPENDENCY: co@4.6.0 (node_modules\fsevents\node_modules\co):
      npm WARN enoent SKIPPING OPTIONAL DEPENDENCY: ENOENT: no such file or directory, rename 'C:\opt\dev\projects\github\liferay-portal-7.0.x-private\modules\apps\frontend-theme-1975-london\frontend-theme-1975-london\node_modules\fsevents\node_modules\co' -> 'C:\opt\dev\projects\github\liferay-portal-7.0.x-private\modules\apps\frontend-theme-1975-london\frontend-theme-1975-london\node_modules\fsevents\node_modules\.co.DELETE'
      npm WARN optional SKIPPING OPTIONAL DEPENDENCY: code-point-at@1.1.0 (node_modules\fsevents\node_modules\code-point-at):
      npm WARN enoent SKIPPING OPTIONAL DEPENDENCY: ENOENT: no such file or directory, rename 'C:\opt\dev\projects\github\liferay-portal-7.0.x-private\modules\apps\frontend-theme-1975-london\frontend-theme-1975-london\node_modules\fsevents\node_modules\code-point-at' -> 'C:\opt\dev\projects\github\liferay-portal-7.0.x-private\modules\apps\frontend-theme-1975-london\frontend-theme-1975-london\node_modules\fsevents\node_modules\.code-point-at.DELETE'
      npm WARN optional SKIPPING OPTIONAL DEPENDENCY: concat-map@0.0.1 (node_modules\fsevents\node_modules\concat-map):
      npm WARN enoent SKIPPING OPTIONAL DEPENDENCY: ENOENT: no such file or directory, rename 'C:\opt\dev\projects\github\liferay-portal-7.0.x-private\modules\apps\frontend-theme-1975-london\frontend-theme-1975-london\node_modules\fsevents\node_modules\concat-map' -> 'C:\opt\dev\projects\github\liferay-portal-7.0.x-private\modules\apps\frontend-theme-1975-london\frontend-theme-1975-london\node_modules\fsevents\node_modules\.concat-map.DELETE'
      npm WARN optional SKIPPING OPTIONAL DEPENDENCY: console-control-strings@1.1.0 (node_modules\fsevents\node_modules\console-control-strings):
      npm WARN enoent SKIPPING OPTIONAL DEPENDENCY: ENOENT: no such file or directory, rename 'C:\opt\dev\projects\github\liferay-portal-7.0.x-private\modules\apps\frontend-theme-1975-london\frontend-theme-1975-london\node_modules\fsevents\node_modules\console-control-strings' -> 'C:\opt\dev\projects\github\liferay-portal-7.0.x-private\modules\apps\frontend-theme-1975-london\frontend-theme-1975-london\node_modules\fsevents\node_modules\.console-control-strings.DELETE'
      npm WARN optional SKIPPING OPTIONAL DEPENDENCY: core-util-is@1.0.2 (node_modules\fsevents\node_modules\core-util-is):
      npm WARN enoent SKIPPING OPTIONAL DEPENDENCY: ENOENT: no such file or directory, rename 'C:\opt\dev\projects\github\liferay-portal-7.0.x-private\modules\apps\frontend-theme-1975-london\frontend-theme-1975-london\node_modules\fsevents\node_modules\core-util-is' -> 'C:\opt\dev\projects\github\liferay-portal-7.0.x-private\modules\apps\frontend-theme-1975-london\frontend-theme-1975-london\node_modules\fsevents\node_modules\.core-util-is.DELETE'
      npm WARN optional SKIPPING OPTIONAL DEPENDENCY: assert-plus@1.0.0 (node_modules\fsevents\node_modules\dashdash\node_modules\assert-plus):
      npm WARN enoent SKIPPING OPTIONAL DEPENDENCY: ENOENT: no such file or directory, rename 'C:\opt\dev\projects\github\liferay-portal-7.0.x-private\modules\apps\frontend-theme-1975-london\frontend-theme-1975-london\node_modules\fsevents\node_modules\dashdash\node_modules\assert-plus' -> 'C:\opt\dev\projects\github\liferay-portal-7.0.x-private\modules\apps\frontend-theme-1975-london\frontend-theme-1975-london\node_modules\fsevents\node_modules\dashdash\node_modules\.assert-plus.DELETE'
      npm WARN optional SKIPPING OPTIONAL DEPENDENCY: deep-extend@0.4.2 (node_modules\fsevents\node_modules\deep-extend):
      npm WARN enoent SKIPPING OPTIONAL DEPENDENCY: ENOENT: no such file or directory, rename 'C:\opt\dev\projects\github\liferay-portal-7.0.x-private\modules\apps\frontend-theme-1975-london\frontend-theme-1975-london\node_modules\fsevents\node_modules\deep-extend' -> 'C:\opt\dev\projects\github\liferay-portal-7.0.x-private\modules\apps\frontend-theme-1975-london\frontend-theme-1975-london\node_modules\fsevents\node_modules\.deep-extend.DELETE'
      npm WARN optional SKIPPING OPTIONAL DEPENDENCY: delayed-stream@1.0.0 (node_modules\fsevents\node_modules\delayed-stream):
      npm WARN enoent SKIPPING OPTIONAL DEPENDENCY: ENOENT: no such file or directory, rename 'C:\opt\dev\projects\github\liferay-portal-7.0.x-private\modules\apps\frontend-theme-1975-london\frontend-theme-1975-london\node_modules\fsevents\node_modules\delayed-stream' -> 'C:\opt\dev\projects\github\liferay-portal-7.0.x-private\modules\apps\frontend-theme-1975-london\frontend-theme-1975-london\node_modules\fsevents\node_modules\.delayed-stream.DELETE'
      npm WARN optional SKIPPING OPTIONAL DEPENDENCY: delegates@1.0.0 (node_modules\fsevents\node_modules\delegates):
      npm WARN enoent SKIPPING OPTIONAL DEPENDENCY: ENOENT: no such file or directory, rename 'C:\opt\dev\projects\github\liferay-portal-7.0.x-private\modules\apps\frontend-theme-1975-london\frontend-theme-1975-london\node_modules\fsevents\node_modules\delegates' -> 'C:\opt\dev\projects\github\liferay-portal-7.0.x-private\modules\apps\frontend-theme-1975-london\frontend-theme-1975-london\node_modules\fsevents\node_modules\.delegates.DELETE'
      npm WARN optional SKIPPING OPTIONAL DEPENDENCY: detect-libc@1.0.2 (node_modules\fsevents\node_modules\detect-libc):
      npm WARN enoent SKIPPING OPTIONAL DEPENDENCY: ENOENT: no such file or directory, rename 'C:\opt\dev\projects\github\liferay-portal-7.0.x-private\modules\apps\frontend-theme-1975-london\frontend-theme-1975-london\node_modules\fsevents\node_modules\detect-libc' -> 'C:\opt\dev\projects\github\liferay-portal-7.0.x-private\modules\apps\frontend-theme-1975-london\frontend-theme-1975-london\node_modules\fsevents\node_modules\.detect-libc.DELETE'
      npm WARN optional SKIPPING OPTIONAL DEPENDENCY: extend@3.0.1 (node_modules\fsevents\node_modules\extend):
      npm WARN enoent SKIPPING OPTIONAL DEPENDENCY: ENOENT: no such file or directory, rename 'C:\opt\dev\projects\github\liferay-portal-7.0.x-private\modules\apps\frontend-theme-1975-london\frontend-theme-1975-london\node_modules\fsevents\node_modules\extend' -> 'C:\opt\dev\projects\github\liferay-portal-7.0.x-private\modules\apps\frontend-theme-1975-london\frontend-theme-1975-london\node_modules\fsevents\node_modules\.extend.DELETE'
      npm WARN optional SKIPPING OPTIONAL DEPENDENCY: extsprintf@1.0.2 (node_modules\fsevents\node_modules\extsprintf):
      npm WARN enoent SKIPPING OPTIONAL DEPENDENCY: ENOENT: no such file or directory, rename 'C:\opt\dev\projects\github\liferay-portal-7.0.x-private\modules\apps\frontend-theme-1975-london\frontend-theme-1975-london\node_modules\fsevents\node_modules\extsprintf' -> 'C:\opt\dev\projects\github\liferay-portal-7.0.x-private\modules\apps\frontend-theme-1975-london\frontend-theme-1975-london\node_modules\fsevents\node_modules\.extsprintf.DELETE'
      npm WARN optional SKIPPING OPTIONAL DEPENDENCY: forever-agent@0.6.1 (node_modules\fsevents\node_modules\forever-agent):
      npm WARN enoent SKIPPING OPTIONAL DEPENDENCY: ENOENT: no such file or directory, rename 'C:\opt\dev\projects\github\liferay-portal-7.0.x-private\modules\apps\frontend-theme-1975-london\frontend-theme-1975-london\node_modules\fsevents\node_modules\forever-agent' -> 'C:\opt\dev\projects\github\liferay-portal-7.0.x-private\modules\apps\frontend-theme-1975-london\frontend-theme-1975-london\node_modules\fsevents\node_modules\.forever-agent.DELETE'
      npm WARN optional SKIPPING OPTIONAL DEPENDENCY: fs.realpath@1.0.0 (node_modules\fsevents\node_modules\fs.realpath):
      npm WARN enoent SKIPPING OPTIONAL DEPENDENCY: ENOENT: no such file or directory, rename 'C:\opt\dev\projects\github\liferay-portal-7.0.x-private\modules\apps\frontend-theme-1975-london\frontend-theme-1975-london\node_modules\fsevents\node_modules\fs.realpath' -> 'C:\opt\dev\projects\github\liferay-portal-7.0.x-private\modules\apps\frontend-theme-1975-london\frontend-theme-1975-london\node_modules\fsevents\node_modules\.fs.realpath.DELETE'
      npm WARN optional SKIPPING OPTIONAL DEPENDENCY: assert-plus@1.0.0 (node_modules\fsevents\node_modules\getpass\node_modules\assert-plus):
      npm WARN enoent SKIPPING OPTIONAL DEPENDENCY: ENOENT: no such file or directory, rename 'C:\opt\dev\projects\github\liferay-portal-7.0.x-private\modules\apps\frontend-theme-1975-london\frontend-theme-1975-london\node_modules\fsevents\node_modules\getpass\node_modules\assert-plus' -> 'C:\opt\dev\projects\github\liferay-portal-7.0.x-private\modules\apps\frontend-theme-1975-london\frontend-theme-1975-london\node_modules\fsevents\node_modules\getpass\node_modules\.assert-plus.DELETE'
      npm WARN optional SKIPPING OPTIONAL DEPENDENCY: graceful-fs@4.1.11 (node_modules\fsevents\node_modules\graceful-fs):
      npm WARN enoent SKIPPING OPTIONAL DEPENDENCY: ENOENT: no such file or directory, rename 'C:\opt\dev\projects\github\liferay-portal-7.0.x-private\modules\apps\frontend-theme-1975-london\frontend-theme-1975-london\node_modules\fsevents\node_modules\graceful-fs' -> 'C:\opt\dev\projects\github\liferay-portal-7.0.x-private\modules\apps\frontend-theme-1975-london\frontend-theme-1975-london\node_modules\fsevents\node_modules\.graceful-fs.DELETE'
      npm WARN optional SKIPPING OPTIONAL DEPENDENCY: har-schema@1.0.5 (node_modules\fsevents\node_modules\har-schema):
      npm WARN enoent SKIPPING OPTIONAL DEPENDENCY: ENOENT: no such file or directory, rename 'C:\opt\dev\projects\github\liferay-portal-7.0.x-private\modules\apps\frontend-theme-1975-london\frontend-theme-1975-london\node_modules\fsevents\node_modules\har-schema' -> 'C:\opt\dev\projects\github\liferay-portal-7.0.x-private\modules\apps\frontend-theme-1975-london\frontend-theme-1975-london\node_modules\fsevents\node_modules\.har-schema.DELETE'
      npm WARN optional SKIPPING OPTIONAL DEPENDENCY: has-unicode@2.0.1 (node_modules\fsevents\node_modules\has-unicode):
      npm WARN enoent SKIPPING OPTIONAL DEPENDENCY: ENOENT: no such file or directory, rename 'C:\opt\dev\projects\github\liferay-portal-7.0.x-private\modules\apps\frontend-theme-1975-london\frontend-theme-1975-london\node_modules\fsevents\node_modules\has-unicode' -> 'C:\opt\dev\projects\github\liferay-portal-7.0.x-private\modules\apps\frontend-theme-1975-london\frontend-theme-1975-london\node_modules\fsevents\node_modules\.has-unicode.DELETE'
      npm WARN optional SKIPPING OPTIONAL DEPENDENCY: hoek@2.16.3 (node_modules\fsevents\node_modules\hoek):
      npm WARN enoent SKIPPING OPTIONAL DEPENDENCY: ENOENT: no such file or directory, rename 'C:\opt\dev\projects\github\liferay-portal-7.0.x-private\modules\apps\frontend-theme-1975-london\frontend-theme-1975-london\node_modules\fsevents\node_modules\hoek' -> 'C:\opt\dev\projects\github\liferay-portal-7.0.x-private\modules\apps\frontend-theme-1975-london\frontend-theme-1975-london\node_modules\fsevents\node_modules\.hoek.DELETE'
      npm WARN optional SKIPPING OPTIONAL DEPENDENCY: inherits@2.0.3 (node_modules\fsevents\node_modules\inherits):
      npm WARN enoent SKIPPING OPTIONAL DEPENDENCY: ENOENT: no such file or directory, rename 'C:\opt\dev\projects\github\liferay-portal-7.0.x-private\modules\apps\frontend-theme-1975-london\frontend-theme-1975-london\node_modules\fsevents\node_modules\inherits' -> 'C:\opt\dev\projects\github\liferay-portal-7.0.x-private\modules\apps\frontend-theme-1975-london\frontend-theme-1975-london\node_modules\fsevents\node_modules\.inherits.DELETE'
      npm WARN optional SKIPPING OPTIONAL DEPENDENCY: ini@1.3.4 (node_modules\fsevents\node_modules\ini):
      npm WARN enoent SKIPPING OPTIONAL DEPENDENCY: ENOENT: no such file or directory, rename 'C:\opt\dev\projects\github\liferay-portal-7.0.x-private\modules\apps\frontend-theme-1975-london\frontend-theme-1975-london\node_modules\fsevents\node_modules\ini' -> 'C:\opt\dev\projects\github\liferay-portal-7.0.x-private\modules\apps\frontend-theme-1975-london\frontend-theme-1975-london\node_modules\fsevents\node_modules\.ini.DELETE'
      npm WARN optional SKIPPING OPTIONAL DEPENDENCY: is-typedarray@1.0.0 (node_modules\fsevents\node_modules\is-typedarray):
      npm WARN enoent SKIPPING OPTIONAL DEPENDENCY: ENOENT: no such file or directory, rename 'C:\opt\dev\projects\github\liferay-portal-7.0.x-private\modules\apps\frontend-theme-1975-london\frontend-theme-1975-london\node_modules\fsevents\node_modules\is-typedarray' -> 'C:\opt\dev\projects\github\liferay-portal-7.0.x-private\modules\apps\frontend-theme-1975-london\frontend-theme-1975-london\node_modules\fsevents\node_modules\.is-typedarray.DELETE'
      npm WARN optional SKIPPING OPTIONAL DEPENDENCY: isarray@1.0.0 (node_modules\fsevents\node_modules\isarray):
      npm WARN enoent SKIPPING OPTIONAL DEPENDENCY: ENOENT: no such file or directory, rename 'C:\opt\dev\projects\github\liferay-portal-7.0.x-private\modules\apps\frontend-theme-1975-london\frontend-theme-1975-london\node_modules\fsevents\node_modules\isarray' -> 'C:\opt\dev\projects\github\liferay-portal-7.0.x-private\modules\apps\frontend-theme-1975-london\frontend-theme-1975-london\node_modules\fsevents\node_modules\.isarray.DELETE'
      npm WARN optional SKIPPING OPTIONAL DEPENDENCY: isstream@0.1.2 (node_modules\fsevents\node_modules\isstream):
      npm WARN enoent SKIPPING OPTIONAL DEPENDENCY: ENOENT: no such file or directory, rename 'C:\opt\dev\projects\github\liferay-portal-7.0.x-private\modules\apps\frontend-theme-1975-london\frontend-theme-1975-london\node_modules\fsevents\node_modules\isstream' -> 'C:\opt\dev\projects\github\liferay-portal-7.0.x-private\modules\apps\frontend-theme-1975-london\frontend-theme-1975-london\node_modules\fsevents\node_modules\.isstream.DELETE'
      npm WARN optional SKIPPING OPTIONAL DEPENDENCY: jsbn@0.1.1 (node_modules\fsevents\node_modules\jsbn):
      npm WARN enoent SKIPPING OPTIONAL DEPENDENCY: ENOENT: no such file or directory, rename 'C:\opt\dev\projects\github\liferay-portal-7.0.x-private\modules\apps\frontend-theme-1975-london\frontend-theme-1975-london\node_modules\fsevents\node_modules\jsbn' -> 'C:\opt\dev\projects\github\liferay-portal-7.0.x-private\modules\apps\frontend-theme-1975-london\frontend-theme-1975-london\node_modules\fsevents\node_modules\.jsbn.DELETE'
      npm WARN optional SKIPPING OPTIONAL DEPENDENCY: ecc-jsbn@0.1.1 (node_modules\fsevents\node_modules\ecc-jsbn):
      npm WARN enoent SKIPPING OPTIONAL DEPENDENCY: ENOENT: no such file or directory, rename 'C:\opt\dev\projects\github\liferay-portal-7.0.x-private\modules\apps\frontend-theme-1975-london\frontend-theme-1975-london\node_modules\fsevents\node_modules\ecc-jsbn' -> 'C:\opt\dev\projects\github\liferay-portal-7.0.x-private\modules\apps\frontend-theme-1975-london\frontend-theme-1975-london\node_modules\fsevents\node_modules\.ecc-jsbn.DELETE'
      npm WARN optional SKIPPING OPTIONAL DEPENDENCY: jodid25519@1.0.2 (node_modules\fsevents\node_modules\jodid25519):
      npm WARN enoent SKIPPING OPTIONAL DEPENDENCY: ENOENT: no such file or directory, rename 'C:\opt\dev\projects\github\liferay-portal-7.0.x-private\modules\apps\frontend-theme-1975-london\frontend-theme-1975-london\node_modules\fsevents\node_modules\jodid25519' -> 'C:\opt\dev\projects\github\liferay-portal-7.0.x-private\modules\apps\frontend-theme-1975-london\frontend-theme-1975-london\node_modules\fsevents\node_modules\.jodid25519.DELETE'
      npm WARN optional SKIPPING OPTIONAL DEPENDENCY: json-schema@0.2.3 (node_modules\fsevents\node_modules\json-schema):
      npm WARN enoent SKIPPING OPTIONAL DEPENDENCY: ENOENT: no such file or directory, rename 'C:\opt\dev\projects\github\liferay-portal-7.0.x-private\modules\apps\frontend-theme-1975-london\frontend-theme-1975-london\node_modules\fsevents\node_modules\json-schema' -> 'C:\opt\dev\projects\github\liferay-portal-7.0.x-private\modules\apps\frontend-theme-1975-london\frontend-theme-1975-london\node_modules\fsevents\node_modules\.json-schema.DELETE'
      npm WARN optional SKIPPING OPTIONAL DEPENDENCY: json-stringify-safe@5.0.1 (node_modules\fsevents\node_modules\json-stringify-safe):
      npm WARN enoent SKIPPING OPTIONAL DEPENDENCY: ENOENT: no such file or directory, rename 'C:\opt\dev\projects\github\liferay-portal-7.0.x-private\modules\apps\frontend-theme-1975-london\frontend-theme-1975-london\node_modules\fsevents\node_modules\json-stringify-safe' -> 'C:\opt\dev\projects\github\liferay-portal-7.0.x-private\modules\apps\frontend-theme-1975-london\frontend-theme-1975-london\node_modules\fsevents\node_modules\.json-stringify-safe.DELETE'
      npm WARN optional SKIPPING OPTIONAL DEPENDENCY: jsonify@0.0.0 (node_modules\fsevents\node_modules\jsonify):
      npm WARN enoent SKIPPING OPTIONAL DEPENDENCY: ENOENT: no such file or directory, rename 'C:\opt\dev\projects\github\liferay-portal-7.0.x-private\modules\apps\frontend-theme-1975-london\frontend-theme-1975-london\node_modules\fsevents\node_modules\jsonify' -> 'C:\opt\dev\projects\github\liferay-portal-7.0.x-private\modules\apps\frontend-theme-1975-london\frontend-theme-1975-london\node_modules\fsevents\node_modules\.jsonify.DELETE'
      npm WARN optional SKIPPING OPTIONAL DEPENDENCY: assert-plus@1.0.0 (node_modules\fsevents\node_modules\jsprim\node_modules\assert-plus):
      npm WARN enoent SKIPPING OPTIONAL DEPENDENCY: ENOENT: no such file or directory, rename 'C:\opt\dev\projects\github\liferay-portal-7.0.x-private\modules\apps\frontend-theme-1975-london\frontend-theme-1975-london\node_modules\fsevents\node_modules\jsprim\node_modules\assert-plus' -> 'C:\opt\dev\projects\github\liferay-portal-7.0.x-private\modules\apps\frontend-theme-1975-london\frontend-theme-1975-london\node_modules\fsevents\node_modules\jsprim\node_modules\.assert-plus.DELETE'
      npm WARN optional SKIPPING OPTIONAL DEPENDENCY: mime-db@1.27.0 (node_modules\fsevents\node_modules\mime-db):
      npm WARN enoent SKIPPING OPTIONAL DEPENDENCY: ENOENT: no such file or directory, rename 'C:\opt\dev\projects\github\liferay-portal-7.0.x-private\modules\apps\frontend-theme-1975-london\frontend-theme-1975-london\node_modules\fsevents\node_modules\mime-db' -> 'C:\opt\dev\projects\github\liferay-portal-7.0.x-private\modules\apps\frontend-theme-1975-london\frontend-theme-1975-london\node_modules\fsevents\node_modules\.mime-db.DELETE'
      npm WARN optional SKIPPING OPTIONAL DEPENDENCY: minimist@0.0.8 (node_modules\fsevents\node_modules\minimist):
      npm WARN enoent SKIPPING OPTIONAL DEPENDENCY: ENOENT: no such file or directory, rename 'C:\opt\dev\projects\github\liferay-portal-7.0.x-private\modules\apps\frontend-theme-1975-london\frontend-theme-1975-london\node_modules\fsevents\node_modules\minimist' -> 'C:\opt\dev\projects\github\liferay-portal-7.0.x-private\modules\apps\frontend-theme-1975-london\frontend-theme-1975-london\node_modules\fsevents\node_modules\.minimist.DELETE'
      npm WARN optional SKIPPING OPTIONAL DEPENDENCY: ms@2.0.0 (node_modules\fsevents\node_modules\ms):
      npm WARN enoent SKIPPING OPTIONAL DEPENDENCY: ENOENT: no such file or directory, rename 'C:\opt\dev\projects\github\liferay-portal-7.0.x-private\modules\apps\frontend-theme-1975-london\frontend-theme-1975-london\node_modules\fsevents\node_modules\ms' -> 'C:\opt\dev\projects\github\liferay-portal-7.0.x-private\modules\apps\frontend-theme-1975-london\frontend-theme-1975-london\node_modules\fsevents\node_modules\.ms.DELETE'
      npm WARN optional SKIPPING OPTIONAL DEPENDENCY: number-is-nan@1.0.1 (node_modules\fsevents\node_modules\number-is-nan):
      npm WARN enoent SKIPPING OPTIONAL DEPENDENCY: ENOENT: no such file or directory, rename 'C:\opt\dev\projects\github\liferay-portal-7.0.x-private\modules\apps\frontend-theme-1975-london\frontend-theme-1975-london\node_modules\fsevents\node_modules\number-is-nan' -> 'C:\opt\dev\projects\github\liferay-portal-7.0.x-private\modules\apps\frontend-theme-1975-london\frontend-theme-1975-london\node_modules\fsevents\node_modules\.number-is-nan.DELETE'
      npm WARN optional SKIPPING OPTIONAL DEPENDENCY: oauth-sign@0.8.2 (node_modules\fsevents\node_modules\oauth-sign):
      npm WARN enoent SKIPPING OPTIONAL DEPENDENCY: ENOENT: no such file or directory, rename 'C:\opt\dev\projects\github\liferay-portal-7.0.x-private\modules\apps\frontend-theme-1975-london\frontend-theme-1975-london\node_modules\fsevents\node_modules\oauth-sign' -> 'C:\opt\dev\projects\github\liferay-portal-7.0.x-private\modules\apps\frontend-theme-1975-london\frontend-theme-1975-london\node_modules\fsevents\node_modules\.oauth-sign.DELETE'
      npm WARN optional SKIPPING OPTIONAL DEPENDENCY: object-assign@4.1.1 (node_modules\fsevents\node_modules\object-assign):
      npm WARN enoent SKIPPING OPTIONAL DEPENDENCY: ENOENT: no such file or directory, rename 'C:\opt\dev\projects\github\liferay-portal-7.0.x-private\modules\apps\frontend-theme-1975-london\frontend-theme-1975-london\node_modules\fsevents\node_modules\object-assign' -> 'C:\opt\dev\projects\github\liferay-portal-7.0.x-private\modules\apps\frontend-theme-1975-london\frontend-theme-1975-london\node_modules\fsevents\node_modules\.object-assign.DELETE'
      npm WARN optional SKIPPING OPTIONAL DEPENDENCY: os-homedir@1.0.2 (node_modules\fsevents\node_modules\os-homedir):
      npm WARN enoent SKIPPING OPTIONAL DEPENDENCY: ENOENT: no such file or directory, rename 'C:\opt\dev\projects\github\liferay-portal-7.0.x-private\modules\apps\frontend-theme-1975-london\frontend-theme-1975-london\node_modules\fsevents\node_modules\os-homedir' -> 'C:\opt\dev\projects\github\liferay-portal-7.0.x-private\modules\apps\frontend-theme-1975-london\frontend-theme-1975-london\node_modules\fsevents\node_modules\.os-homedir.DELETE'
      npm WARN optional SKIPPING OPTIONAL DEPENDENCY: os-tmpdir@1.0.2 (node_modules\fsevents\node_modules\os-tmpdir):
      npm WARN enoent SKIPPING OPTIONAL DEPENDENCY: ENOENT: no such file or directory, rename 'C:\opt\dev\projects\github\liferay-portal-7.0.x-private\modules\apps\frontend-theme-1975-london\frontend-theme-1975-london\node_modules\fsevents\node_modules\os-tmpdir' -> 'C:\opt\dev\projects\github\liferay-portal-7.0.x-private\modules\apps\frontend-theme-1975-london\frontend-theme-1975-london\node_modules\fsevents\node_modules\.os-tmpdir.DELETE'
      npm WARN optional SKIPPING OPTIONAL DEPENDENCY: path-is-absolute@1.0.1 (node_modules\fsevents\node_modules\path-is-absolute):
      npm WARN enoent SKIPPING OPTIONAL DEPENDENCY: ENOENT: no such file or directory, rename 'C:\opt\dev\projects\github\liferay-portal-7.0.x-private\modules\apps\frontend-theme-1975-london\frontend-theme-1975-london\node_modules\fsevents\node_modules\path-is-absolute' -> 'C:\opt\dev\projects\github\liferay-portal-7.0.x-private\modules\apps\frontend-theme-1975-london\frontend-theme-1975-london\node_modules\fsevents\node_modules\.path-is-absolute.DELETE'
      npm WARN optional SKIPPING OPTIONAL DEPENDENCY: performance-now@0.2.0 (node_modules\fsevents\node_modules\performance-now):
      npm WARN enoent SKIPPING OPTIONAL DEPENDENCY: ENOENT: no such file or directory, rename 'C:\opt\dev\projects\github\liferay-portal-7.0.x-private\modules\apps\frontend-theme-1975-london\frontend-theme-1975-london\node_modules\fsevents\node_modules\performance-now' -> 'C:\opt\dev\projects\github\liferay-portal-7.0.x-private\modules\apps\frontend-theme-1975-london\frontend-theme-1975-london\node_modules\fsevents\node_modules\.performance-now.DELETE'
      npm WARN optional SKIPPING OPTIONAL DEPENDENCY: process-nextick-args@1.0.7 (node_modules\fsevents\node_modules\process-nextick-args):
      npm WARN enoent SKIPPING OPTIONAL DEPENDENCY: ENOENT: no such file or directory, rename 'C:\opt\dev\projects\github\liferay-portal-7.0.x-private\modules\apps\frontend-theme-1975-london\frontend-theme-1975-london\node_modules\fsevents\node_modules\process-nextick-args' -> 'C:\opt\dev\projects\github\liferay-portal-7.0.x-private\modules\apps\frontend-theme-1975-london\frontend-theme-1975-london\node_modules\fsevents\node_modules\.process-nextick-args.DELETE'
      npm WARN optional SKIPPING OPTIONAL DEPENDENCY: punycode@1.4.1 (node_modules\fsevents\node_modules\punycode):
      npm WARN enoent SKIPPING OPTIONAL DEPENDENCY: ENOENT: no such file or directory, rename 'C:\opt\dev\projects\github\liferay-portal-7.0.x-private\modules\apps\frontend-theme-1975-london\frontend-theme-1975-london\node_modules\fsevents\node_modules\punycode' -> 'C:\opt\dev\projects\github\liferay-portal-7.0.x-private\modules\apps\frontend-theme-1975-london\frontend-theme-1975-london\node_modules\fsevents\node_modules\.punycode.DELETE'
      npm WARN optional SKIPPING OPTIONAL DEPENDENCY: qs@6.4.0 (node_modules\fsevents\node_modules\qs):
      npm WARN enoent SKIPPING OPTIONAL DEPENDENCY: ENOENT: no such file or directory, rename 'C:\opt\dev\projects\github\liferay-portal-7.0.x-private\modules\apps\frontend-theme-1975-london\frontend-theme-1975-london\node_modules\fsevents\node_modules\qs' -> 'C:\opt\dev\projects\github\liferay-portal-7.0.x-private\modules\apps\frontend-theme-1975-london\frontend-theme-1975-london\node_modules\fsevents\node_modules\.qs.DELETE'
      npm WARN optional SKIPPING OPTIONAL DEPENDENCY: minimist@1.2.0 (node_modules\fsevents\node_modules\rc\node_modules\minimist):
      npm WARN enoent SKIPPING OPTIONAL DEPENDENCY: ENOENT: no such file or directory, rename 'C:\opt\dev\projects\github\liferay-portal-7.0.x-private\modules\apps\frontend-theme-1975-london\frontend-theme-1975-london\node_modules\fsevents\node_modules\rc\node_modules\minimist' -> 'C:\opt\dev\projects\github\liferay-portal-7.0.x-private\modules\apps\frontend-theme-1975-london\frontend-theme-1975-london\node_modules\fsevents\node_modules\rc\node_modules\.minimist.DELETE'
      npm WARN optional SKIPPING OPTIONAL DEPENDENCY: safe-buffer@5.0.1 (node_modules\fsevents\node_modules\safe-buffer):
      npm WARN enoent SKIPPING OPTIONAL DEPENDENCY: ENOENT: no such file or directory, rename 'C:\opt\dev\projects\github\liferay-portal-7.0.x-private\modules\apps\frontend-theme-1975-london\frontend-theme-1975-london\node_modules\fsevents\node_modules\safe-buffer' -> 'C:\opt\dev\projects\github\liferay-portal-7.0.x-private\modules\apps\frontend-theme-1975-london\frontend-theme-1975-london\node_modules\fsevents\node_modules\.safe-buffer.DELETE'
      npm WARN optional SKIPPING OPTIONAL DEPENDENCY: semver@5.3.0 (node_modules\fsevents\node_modules\semver):
      npm WARN enoent SKIPPING OPTIONAL DEPENDENCY: ENOENT: no such file or directory, rename 'C:\opt\dev\projects\github\liferay-portal-7.0.x-private\modules\apps\frontend-theme-1975-london\frontend-theme-1975-london\node_modules\fsevents\node_modules\semver' -> 'C:\opt\dev\projects\github\liferay-portal-7.0.x-private\modules\apps\frontend-theme-1975-london\frontend-theme-1975-london\node_modules\fsevents\node_modules\.semver.DELETE'
      npm WARN optional SKIPPING OPTIONAL DEPENDENCY: set-blocking@2.0.0 (node_modules\fsevents\node_modules\set-blocking):
      npm WARN enoent SKIPPING OPTIONAL DEPENDENCY: ENOENT: no such file or directory, rename 'C:\opt\dev\projects\github\liferay-portal-7.0.x-private\modules\apps\frontend-theme-1975-london\frontend-theme-1975-london\node_modules\fsevents\node_modules\set-blocking' -> 'C:\opt\dev\projects\github\liferay-portal-7.0.x-private\modules\apps\frontend-theme-1975-london\frontend-theme-1975-london\node_modules\fsevents\node_modules\.set-blocking.DELETE'
      npm WARN optional SKIPPING OPTIONAL DEPENDENCY: signal-exit@3.0.2 (node_modules\fsevents\node_modules\signal-exit):
      npm WARN enoent SKIPPING OPTIONAL DEPENDENCY: ENOENT: no such file or directory, rename 'C:\opt\dev\projects\github\liferay-portal-7.0.x-private\modules\apps\frontend-theme-1975-london\frontend-theme-1975-london\node_modules\fsevents\node_modules\signal-exit' -> 'C:\opt\dev\projects\github\liferay-portal-7.0.x-private\modules\apps\frontend-theme-1975-london\frontend-theme-1975-london\node_modules\fsevents\node_modules\.signal-exit.DELETE'
      npm WARN optional SKIPPING OPTIONAL DEPENDENCY: assert-plus@1.0.0 (node_modules\fsevents\node_modules\sshpk\node_modules\assert-plus):
      npm WARN enoent SKIPPING OPTIONAL DEPENDENCY: ENOENT: no such file or directory, rename 'C:\opt\dev\projects\github\liferay-portal-7.0.x-private\modules\apps\frontend-theme-1975-london\frontend-theme-1975-london\node_modules\fsevents\node_modules\sshpk\node_modules\assert-plus' -> 'C:\opt\dev\projects\github\liferay-portal-7.0.x-private\modules\apps\frontend-theme-1975-london\frontend-theme-1975-london\node_modules\fsevents\node_modules\sshpk\node_modules\.assert-plus.DELETE'
      npm WARN optional SKIPPING OPTIONAL DEPENDENCY: stringstream@0.0.5 (node_modules\fsevents\node_modules\stringstream):
      npm WARN enoent SKIPPING OPTIONAL DEPENDENCY: ENOENT: no such file or directory, rename 'C:\opt\dev\projects\github\liferay-portal-7.0.x-private\modules\apps\frontend-theme-1975-london\frontend-theme-1975-london\node_modules\fsevents\node_modules\stringstream' -> 'C:\opt\dev\projects\github\liferay-portal-7.0.x-private\modules\apps\frontend-theme-1975-london\frontend-theme-1975-london\node_modules\fsevents\node_modules\.stringstream.DELETE'
      npm WARN optional SKIPPING OPTIONAL DEPENDENCY: strip-json-comments@2.0.1 (node_modules\fsevents\node_modules\strip-json-comments):
      npm WARN enoent SKIPPING OPTIONAL DEPENDENCY: ENOENT: no such file or directory, rename 'C:\opt\dev\projects\github\liferay-portal-7.0.x-private\modules\apps\frontend-theme-1975-london\frontend-theme-1975-london\node_modules\fsevents\node_modules\strip-json-comments' -> 'C:\opt\dev\projects\github\liferay-portal-7.0.x-private\modules\apps\frontend-theme-1975-london\frontend-theme-1975-london\node_modules\fsevents\node_modules\.strip-json-comments.DELETE'
      npm WARN optional SKIPPING OPTIONAL DEPENDENCY: tweetnacl@0.14.5 (node_modules\fsevents\node_modules\tweetnacl):
      npm WARN enoent SKIPPING OPTIONAL DEPENDENCY: ENOENT: no such file or directory, rename 'C:\opt\dev\projects\github\liferay-portal-7.0.x-private\modules\apps\frontend-theme-1975-london\frontend-theme-1975-london\node_modules\fsevents\node_modules\tweetnacl' -> 'C:\opt\dev\projects\github\liferay-portal-7.0.x-private\modules\apps\frontend-theme-1975-london\frontend-theme-1975-london\node_modules\fsevents\node_modules\.tweetnacl.DELETE'
      npm WARN optional SKIPPING OPTIONAL DEPENDENCY: bcrypt-pbkdf@1.0.1 (node_modules\fsevents\node_modules\bcrypt-pbkdf):
      npm WARN enoent SKIPPING OPTIONAL DEPENDENCY: ENOENT: no such file or directory, rename 'C:\opt\dev\projects\github\liferay-portal-7.0.x-private\modules\apps\frontend-theme-1975-london\frontend-theme-1975-london\node_modules\fsevents\node_modules\bcrypt-pbkdf' -> 'C:\opt\dev\projects\github\liferay-portal-7.0.x-private\modules\apps\frontend-theme-1975-london\frontend-theme-1975-london\node_modules\fsevents\node_modules\.bcrypt-pbkdf.DELETE'
      npm WARN optional SKIPPING OPTIONAL DEPENDENCY: uid-number@0.0.6 (node_modules\fsevents\node_modules\uid-number):
      npm WARN enoent SKIPPING OPTIONAL DEPENDENCY: ENOENT: no such file or directory, rename 'C:\opt\dev\projects\github\liferay-portal-7.0.x-private\modules\apps\frontend-theme-1975-london\frontend-theme-1975-london\node_modules\fsevents\node_modules\uid-number' -> 'C:\opt\dev\projects\github\liferay-portal-7.0.x-private\modules\apps\frontend-theme-1975-london\frontend-theme-1975-london\node_modules\fsevents\node_modules\.uid-number.DELETE'
      npm WARN optional SKIPPING OPTIONAL DEPENDENCY: util-deprecate@1.0.2 (node_modules\fsevents\node_modules\util-deprecate):
      npm WARN enoent SKIPPING OPTIONAL DEPENDENCY: ENOENT: no such file or directory, rename 'C:\opt\dev\projects\github\liferay-portal-7.0.x-private\modules\apps\frontend-theme-1975-london\frontend-theme-1975-london\node_modules\fsevents\node_modules\util-deprecate' -> 'C:\opt\dev\projects\github\liferay-portal-7.0.x-private\modules\apps\frontend-theme-1975-london\frontend-theme-1975-london\node_modules\fsevents\node_modules\.util-deprecate.DELETE'
      npm WARN optional SKIPPING OPTIONAL DEPENDENCY: uuid@3.0.1 (node_modules\fsevents\node_modules\uuid):
      npm WARN enoent SKIPPING OPTIONAL DEPENDENCY: ENOENT: no such file or directory, rename 'C:\opt\dev\projects\github\liferay-portal-7.0.x-private\modules\apps\frontend-theme-1975-london\frontend-theme-1975-london\node_modules\fsevents\node_modules\uuid' -> 'C:\opt\dev\projects\github\liferay-portal-7.0.x-private\modules\apps\frontend-theme-1975-london\frontend-theme-1975-london\node_modules\fsevents\node_modules\.uuid.DELETE'
      npm WARN optional SKIPPING OPTIONAL DEPENDENCY: wrappy@1.0.2 (node_modules\fsevents\node_modules\wrappy):
      npm WARN enoent SKIPPING OPTIONAL DEPENDENCY: ENOENT: no such file or directory, rename 'C:\opt\dev\projects\github\liferay-portal-7.0.x-private\modules\apps\frontend-theme-1975-london\frontend-theme-1975-london\node_modules\fsevents\node_modules\wrappy' -> 'C:\opt\dev\projects\github\liferay-portal-7.0.x-private\modules\apps\frontend-theme-1975-london\frontend-theme-1975-london\node_modules\fsevents\node_modules\.wrappy.DELETE'
      
      npm ERR! code ELIFECYCLE
      npm ERR! errno 1
      npm ERR! coffee-script@1.12.8 postinstall: `node --eval 'if (require("./package.json").name === "coffee-script") { var red, yellow, cyan, reset; red = yellow = cyan = reset = ""; if (!process.env.NODE_DISABLE_COLORS) { red = "\x1b[31m"; yellow = "\x1b[33m"; cyan = "\x1b[36m"; reset = "\x1b[0m"; } console.warn(red + "CoffeeScript has moved!" + reset + " Please update references to " + yellow + "\"coffee-script\"" + reset + " to use " + yellow + "\"coffeescript\"" + reset + " (no hyphen) instead."); console.warn("Also, a new major version has been released under the " + yellow + "coffeescript" + reset + " name on NPM. This new release targets modern JavaScript, with minimal breaking changes. Learn more at " + cyan + "http://coffeescript.org" + reset + "."); console.warn(""); }'`
      npm ERR! Exit status 1
      npm ERR! 
      npm ERR! Failed at the coffee-script@1.12.8 postinstall script.
      npm ERR! This is probably not a problem with npm. There is likely additional logging output above.
      
      npm ERR! A complete log of this run can be found in:
      npm ERR!     C:\Users\Administrator\AppData\Roaming\npm-cache\_logs\2018-03-30T20_43_11_895Z-debug.log
      Process '[cmd, /c, ""C:\opt\dev\projects\github\liferay-portal-7.0.x-private\modules\apps\frontend-theme-1975-london\frontend-theme-1975-london\build_gradle\node\node" "C:/opt/dev/projects/github/liferay-portal-7.0.x-private/modules/apps/frontend-theme-1975-london/frontend-theme-1975-london/build_gradle/node/node_modules/npm/bin/npm-cli.js" "--loglevel" "warn" "--progress" "true" "--registry" "http://mirrors.lax.liferay.com:4873" "install""]' finished with non-zero exit value 1. Running "npm install" again
      npm WARN deprecated minimatch@2.0.10: Please update to minimatch 3.0.2 or higher to avoid a RegExp DoS issue
      npm WARN deprecated minimatch@0.2.14: Please update to minimatch 3.0.2 or higher to avoid a RegExp DoS issue
      npm WARN deprecated graceful-fs@1.2.3: graceful-fs v3.0.0 and before will fail on node releases >= v7.0. Please update to graceful-fs@^4.0.0 as soon as possible. Use 'npm ls graceful-fs' to find it in the tree.
      
      > node-sass@3.13.1 install C:\opt\dev\projects\github\liferay-portal-7.0.x-private\modules\apps\frontend-theme-1975-london\frontend-theme-1975-london\node_modules\gulp-metal\node_modules\node-sass
      > node scripts/install.js
      
      Cached binary found at C:\Users\Administrator\AppData\Roaming\npm-cache\node-sass\3.13.1\win32-x64-48_binding.node
      
      > node-sass@3.13.1 install C:\opt\dev\projects\github\liferay-portal-7.0.x-private\modules\apps\frontend-theme-1975-london\frontend-theme-1975-london\node_modules\node-sass
      > node scripts/install.js
      
      Cached binary found at C:\Users\Administrator\AppData\Roaming\npm-cache\node-sass\3.13.1\win32-x64-48_binding.node
      
      > liferay-theme-deps-7.0@1.0.0 install C:\opt\dev\projects\github\liferay-portal-7.0.x-private\modules\apps\frontend-theme-1975-london\frontend-theme-1975-london\node_modules\liferay-theme-deps-7.0
      > node scripts/install.js
      
      
      > coffee-script@1.12.8 postinstall C:\opt\dev\projects\github\liferay-portal-7.0.x-private\modules\apps\frontend-theme-1975-london\frontend-theme-1975-london\node_modules\coffee-script
      > node --eval 'if (require("./package.json").name === "coffee-script") { var red, yellow, cyan, reset; red = yellow = cyan = reset = ""; if (!process.env.NODE_DISABLE_COLORS) { red = "\x1b[31m"; yellow = "\x1b[33m"; cyan = "\x1b[36m"; reset = "\x1b[0m"; } console.warn(red + "CoffeeScript has moved!" + reset + " Please update references to " + yellow + "\"coffee-script\"" + reset + " to use " + yellow + "\"coffeescript\"" + reset + " (no hyphen) instead."); console.warn("Also, a new major version has been released under the " + yellow + "coffeescript" + reset + " name on NPM. This new release targets modern JavaScript, with minimal breaking changes. Learn more at " + cyan + "http://coffeescript.org" + reset + "."); console.warn(""); }'
      
      [eval]:1
      'if
      ^^^
      SyntaxError: Invalid or unexpected token
          at Object.exports.runInThisContext (vm.js:76:16)
          at Object.<anonymous> ([eval]-wrapper:6:22)
          at Module._compile (module.js:556:32)
          at bootstrap_node.js:357:29
          at _combinedTickCallback (internal/process/next_tick.js:67:7)
          at process._tickCallback (internal/process/next_tick.js:98:9)
      npm WARN optional SKIPPING OPTIONAL DEPENDENCY: fsevents@^1.0.0 (node_modules\gulp-metal\node_modules\chokidar\node_modules\fsevents):
      npm WARN notsup SKIPPING OPTIONAL DEPENDENCY: Unsupported platform for fsevents@1.1.3: wanted {"os":"darwin","arch":"any"} (current: {"os":"win32","arch":"x64"})
      npm WARN ajv-keywords@3.1.0 requires a peer of ajv@^6.0.0 but none is installed. You must install peer dependencies yourself.
      npm WARN liferay-1975-london-theme@1.0.31 No description
      npm WARN liferay-1975-london-theme@1.0.31 license should be a valid SPDX license expression
      npm WARN optional SKIPPING OPTIONAL DEPENDENCY: abbrev@1.1.0 (node_modules\fsevents\node_modules\abbrev):
      npm WARN enoent SKIPPING OPTIONAL DEPENDENCY: ENOENT: no such file or directory, rename 'C:\opt\dev\projects\github\liferay-portal-7.0.x-private\modules\apps\frontend-theme-1975-london\frontend-theme-1975-london\node_modules\fsevents\node_modules\abbrev' -> 'C:\opt\dev\projects\github\liferay-portal-7.0.x-private\modules\apps\frontend-theme-1975-london\frontend-theme-1975-london\node_modules\fsevents\node_modules\.abbrev.DELETE'
      npm WARN optional SKIPPING OPTIONAL DEPENDENCY: ansi-regex@2.1.1 (node_modules\fsevents\node_modules\ansi-regex):
      npm WARN enoent SKIPPING OPTIONAL DEPENDENCY: ENOENT: no such file or directory, rename 'C:\opt\dev\projects\github\liferay-portal-7.0.x-private\modules\apps\frontend-theme-1975-london\frontend-theme-1975-london\node_modules\fsevents\node_modules\ansi-regex' -> 'C:\opt\dev\projects\github\liferay-portal-7.0.x-private\modules\apps\frontend-theme-1975-london\frontend-theme-1975-london\node_modules\fsevents\node_modules\.ansi-regex.DELETE'
      npm WARN optional SKIPPING OPTIONAL DEPENDENCY: aproba@1.1.1 (node_modules\fsevents\node_modules\aproba):
      npm WARN enoent SKIPPING OPTIONAL DEPENDENCY: ENOENT: no such file or directory, rename 'C:\opt\dev\projects\github\liferay-portal-7.0.x-private\modules\apps\frontend-theme-1975-london\frontend-theme-1975-london\node_modules\fsevents\node_modules\aproba' -> 'C:\opt\dev\projects\github\liferay-portal-7.0.x-private\modules\apps\frontend-theme-1975-london\frontend-theme-1975-london\node_modules\fsevents\node_modules\.aproba.DELETE'
      npm WARN optional SKIPPING OPTIONAL DEPENDENCY: asn1@0.2.3 (node_modules\fsevents\node_modules\asn1):
      npm WARN enoent SKIPPING OPTIONAL DEPENDENCY: ENOENT: no such file or directory, rename 'C:\opt\dev\projects\github\liferay-portal-7.0.x-private\modules\apps\frontend-theme-1975-london\frontend-theme-1975-london\node_modules\fsevents\node_modules\asn1' -> 'C:\opt\dev\projects\github\liferay-portal-7.0.x-private\modules\apps\frontend-theme-1975-london\frontend-theme-1975-london\node_modules\fsevents\node_modules\.asn1.DELETE'
      npm WARN optional SKIPPING OPTIONAL DEPENDENCY: assert-plus@0.2.0 (node_modules\fsevents\node_modules\assert-plus):
      npm WARN enoent SKIPPING OPTIONAL DEPENDENCY: ENOENT: no such file or directory, rename 'C:\opt\dev\projects\github\liferay-portal-7.0.x-private\modules\apps\frontend-theme-1975-london\frontend-theme-1975-london\node_modules\fsevents\node_modules\assert-plus' -> 'C:\opt\dev\projects\github\liferay-portal-7.0.x-private\modules\apps\frontend-theme-1975-london\frontend-theme-1975-london\node_modules\fsevents\node_modules\.assert-plus.DELETE'
      npm WARN optional SKIPPING OPTIONAL DEPENDENCY: asynckit@0.4.0 (node_modules\fsevents\node_modules\asynckit):
      npm WARN enoent SKIPPING OPTIONAL DEPENDENCY: ENOENT: no such file or directory, rename 'C:\opt\dev\projects\github\liferay-portal-7.0.x-private\modules\apps\frontend-theme-1975-london\frontend-theme-1975-london\node_modules\fsevents\node_modules\asynckit' -> 'C:\opt\dev\projects\github\liferay-portal-7.0.x-private\modules\apps\frontend-theme-1975-london\frontend-theme-1975-london\node_modules\fsevents\node_modules\.asynckit.DELETE'
      npm WARN optional SKIPPING OPTIONAL DEPENDENCY: aws-sign2@0.6.0 (node_modules\fsevents\node_modules\aws-sign2):
      npm WARN enoent SKIPPING OPTIONAL DEPENDENCY: ENOENT: no such file or directory, rename 'C:\opt\dev\projects\github\liferay-portal-7.0.x-private\modules\apps\frontend-theme-1975-london\frontend-theme-1975-london\node_modules\fsevents\node_modules\aws-sign2' -> 'C:\opt\dev\projects\github\liferay-portal-7.0.x-private\modules\apps\frontend-theme-1975-london\frontend-theme-1975-london\node_modules\fsevents\node_modules\.aws-sign2.DELETE'
      npm WARN optional SKIPPING OPTIONAL DEPENDENCY: aws4@1.6.0 (node_modules\fsevents\node_modules\aws4):
      npm WARN enoent SKIPPING OPTIONAL DEPENDENCY: ENOENT: no such file or directory, rename 'C:\opt\dev\projects\github\liferay-portal-7.0.x-private\modules\apps\frontend-theme-1975-london\frontend-theme-1975-london\node_modules\fsevents\node_modules\aws4' -> 'C:\opt\dev\projects\github\liferay-portal-7.0.x-private\modules\apps\frontend-theme-1975-london\frontend-theme-1975-london\node_modules\fsevents\node_modules\.aws4.DELETE'
      npm WARN optional SKIPPING OPTIONAL DEPENDENCY: balanced-match@0.4.2 (node_modules\fsevents\node_modules\balanced-match):
      npm WARN enoent SKIPPING OPTIONAL DEPENDENCY: ENOENT: no such file or directory, rename 'C:\opt\dev\projects\github\liferay-portal-7.0.x-private\modules\apps\frontend-theme-1975-london\frontend-theme-1975-london\node_modules\fsevents\node_modules\balanced-match' -> 'C:\opt\dev\projects\github\liferay-portal-7.0.x-private\modules\apps\frontend-theme-1975-london\frontend-theme-1975-london\node_modules\fsevents\node_modules\.balanced-match.DELETE'
      npm WARN optional SKIPPING OPTIONAL DEPENDENCY: buffer-shims@1.0.0 (node_modules\fsevents\node_modules\buffer-shims):
      npm WARN enoent SKIPPING OPTIONAL DEPENDENCY: ENOENT: no such file or directory, rename 'C:\opt\dev\projects\github\liferay-portal-7.0.x-private\modules\apps\frontend-theme-1975-london\frontend-theme-1975-london\node_modules\fsevents\node_modules\buffer-shims' -> 'C:\opt\dev\projects\github\liferay-portal-7.0.x-private\modules\apps\frontend-theme-1975-london\frontend-theme-1975-london\node_modules\fsevents\node_modules\.buffer-shims.DELETE'
      npm WARN optional SKIPPING OPTIONAL DEPENDENCY: caseless@0.12.0 (node_modules\fsevents\node_modules\caseless):
      npm WARN enoent SKIPPING OPTIONAL DEPENDENCY: ENOENT: no such file or directory, rename 'C:\opt\dev\projects\github\liferay-portal-7.0.x-private\modules\apps\frontend-theme-1975-london\frontend-theme-1975-london\node_modules\fsevents\node_modules\caseless' -> 'C:\opt\dev\projects\github\liferay-portal-7.0.x-private\modules\apps\frontend-theme-1975-london\frontend-theme-1975-london\node_modules\fsevents\node_modules\.caseless.DELETE'
      npm WARN optional SKIPPING OPTIONAL DEPENDENCY: co@4.6.0 (node_modules\fsevents\node_modules\co):
      npm WARN enoent SKIPPING OPTIONAL DEPENDENCY: ENOENT: no such file or directory, rename 'C:\opt\dev\projects\github\liferay-portal-7.0.x-private\modules\apps\frontend-theme-1975-london\frontend-theme-1975-london\node_modules\fsevents\node_modules\co' -> 'C:\opt\dev\projects\github\liferay-portal-7.0.x-private\modules\apps\frontend-theme-1975-london\frontend-theme-1975-london\node_modules\fsevents\node_modules\.co.DELETE'
      npm WARN optional SKIPPING OPTIONAL DEPENDENCY: code-point-at@1.1.0 (node_modules\fsevents\node_modules\code-point-at):
      npm WARN enoent SKIPPING OPTIONAL DEPENDENCY: ENOENT: no such file or directory, rename 'C:\opt\dev\projects\github\liferay-portal-7.0.x-private\modules\apps\frontend-theme-1975-london\frontend-theme-1975-london\node_modules\fsevents\node_modules\code-point-at' -> 'C:\opt\dev\projects\github\liferay-portal-7.0.x-private\modules\apps\frontend-theme-1975-london\frontend-theme-1975-london\node_modules\fsevents\node_modules\.code-point-at.DELETE'
      npm WARN optional SKIPPING OPTIONAL DEPENDENCY: concat-map@0.0.1 (node_modules\fsevents\node_modules\concat-map):
      npm WARN enoent SKIPPING OPTIONAL DEPENDENCY: ENOENT: no such file or directory, rename 'C:\opt\dev\projects\github\liferay-portal-7.0.x-private\modules\apps\frontend-theme-1975-london\frontend-theme-1975-london\node_modules\fsevents\node_modules\concat-map' -> 'C:\opt\dev\projects\github\liferay-portal-7.0.x-private\modules\apps\frontend-theme-1975-london\frontend-theme-1975-london\node_modules\fsevents\node_modules\.concat-map.DELETE'
      npm WARN optional SKIPPING OPTIONAL DEPENDENCY: console-control-strings@1.1.0 (node_modules\fsevents\node_modules\console-control-strings):
      npm WARN enoent SKIPPING OPTIONAL DEPENDENCY: ENOENT: no such file or directory, rename 'C:\opt\dev\projects\github\liferay-portal-7.0.x-private\modules\apps\frontend-theme-1975-london\frontend-theme-1975-london\node_modules\fsevents\node_modules\console-control-strings' -> 'C:\opt\dev\projects\github\liferay-portal-7.0.x-private\modules\apps\frontend-theme-1975-london\frontend-theme-1975-london\node_modules\fsevents\node_modules\.console-control-strings.DELETE'
      npm WARN optional SKIPPING OPTIONAL DEPENDENCY: core-util-is@1.0.2 (node_modules\fsevents\node_modules\core-util-is):
      npm WARN enoent SKIPPING OPTIONAL DEPENDENCY: ENOENT: no such file or directory, rename 'C:\opt\dev\projects\github\liferay-portal-7.0.x-private\modules\apps\frontend-theme-1975-london\frontend-theme-1975-london\node_modules\fsevents\node_modules\core-util-is' -> 'C:\opt\dev\projects\github\liferay-portal-7.0.x-private\modules\apps\frontend-theme-1975-london\frontend-theme-1975-london\node_modules\fsevents\node_modules\.core-util-is.DELETE'
      npm WARN optional SKIPPING OPTIONAL DEPENDENCY: assert-plus@1.0.0 (node_modules\fsevents\node_modules\dashdash\node_modules\assert-plus):
      npm WARN enoent SKIPPING OPTIONAL DEPENDENCY: ENOENT: no such file or directory, rename 'C:\opt\dev\projects\github\liferay-portal-7.0.x-private\modules\apps\frontend-theme-1975-london\frontend-theme-1975-london\node_modules\fsevents\node_modules\dashdash\node_modules\assert-plus' -> 'C:\opt\dev\projects\github\liferay-portal-7.0.x-private\modules\apps\frontend-theme-1975-london\frontend-theme-1975-london\node_modules\fsevents\node_modules\dashdash\node_modules\.assert-plus.DELETE'
      npm WARN optional SKIPPING OPTIONAL DEPENDENCY: deep-extend@0.4.2 (node_modules\fsevents\node_modules\deep-extend):
      npm WARN enoent SKIPPING OPTIONAL DEPENDENCY: ENOENT: no such file or directory, rename 'C:\opt\dev\projects\github\liferay-portal-7.0.x-private\modules\apps\frontend-theme-1975-london\frontend-theme-1975-london\node_modules\fsevents\node_modules\deep-extend' -> 'C:\opt\dev\projects\github\liferay-portal-7.0.x-private\modules\apps\frontend-theme-1975-london\frontend-theme-1975-london\node_modules\fsevents\node_modules\.deep-extend.DELETE'
      npm WARN optional SKIPPING OPTIONAL DEPENDENCY: delayed-stream@1.0.0 (node_modules\fsevents\node_modules\delayed-stream):
      npm WARN enoent SKIPPING OPTIONAL DEPENDENCY: ENOENT: no such file or directory, rename 'C:\opt\dev\projects\github\liferay-portal-7.0.x-private\modules\apps\frontend-theme-1975-london\frontend-theme-1975-london\node_modules\fsevents\node_modules\delayed-stream' -> 'C:\opt\dev\projects\github\liferay-portal-7.0.x-private\modules\apps\frontend-theme-1975-london\frontend-theme-1975-london\node_modules\fsevents\node_modules\.delayed-stream.DELETE'
      npm WARN optional SKIPPING OPTIONAL DEPENDENCY: delegates@1.0.0 (node_modules\fsevents\node_modules\delegates):
      npm WARN enoent SKIPPING OPTIONAL DEPENDENCY: ENOENT: no such file or directory, rename 'C:\opt\dev\projects\github\liferay-portal-7.0.x-private\modules\apps\frontend-theme-1975-london\frontend-theme-1975-london\node_modules\fsevents\node_modules\delegates' -> 'C:\opt\dev\projects\github\liferay-portal-7.0.x-private\modules\apps\frontend-theme-1975-london\frontend-theme-1975-london\node_modules\fsevents\node_modules\.delegates.DELETE'
      npm WARN optional SKIPPING OPTIONAL DEPENDENCY: detect-libc@1.0.2 (node_modules\fsevents\node_modules\detect-libc):
      npm WARN enoent SKIPPING OPTIONAL DEPENDENCY: ENOENT: no such file or directory, rename 'C:\opt\dev\projects\github\liferay-portal-7.0.x-private\modules\apps\frontend-theme-1975-london\frontend-theme-1975-london\node_modules\fsevents\node_modules\detect-libc' -> 'C:\opt\dev\projects\github\liferay-portal-7.0.x-private\modules\apps\frontend-theme-1975-london\frontend-theme-1975-london\node_modules\fsevents\node_modules\.detect-libc.DELETE'
      npm WARN optional SKIPPING OPTIONAL DEPENDENCY: extend@3.0.1 (node_modules\fsevents\node_modules\extend):
      npm WARN enoent SKIPPING OPTIONAL DEPENDENCY: ENOENT: no such file or directory, rename 'C:\opt\dev\projects\github\liferay-portal-7.0.x-private\modules\apps\frontend-theme-1975-london\frontend-theme-1975-london\node_modules\fsevents\node_modules\extend' -> 'C:\opt\dev\projects\github\liferay-portal-7.0.x-private\modules\apps\frontend-theme-1975-london\frontend-theme-1975-london\node_modules\fsevents\node_modules\.extend.DELETE'
      npm WARN optional SKIPPING OPTIONAL DEPENDENCY: extsprintf@1.0.2 (node_modules\fsevents\node_modules\extsprintf):
      npm WARN enoent SKIPPING OPTIONAL DEPENDENCY: ENOENT: no such file or directory, rename 'C:\opt\dev\projects\github\liferay-portal-7.0.x-private\modules\apps\frontend-theme-1975-london\frontend-theme-1975-london\node_modules\fsevents\node_modules\extsprintf' -> 'C:\opt\dev\projects\github\liferay-portal-7.0.x-private\modules\apps\frontend-theme-1975-london\frontend-theme-1975-london\node_modules\fsevents\node_modules\.extsprintf.DELETE'
      npm WARN optional SKIPPING OPTIONAL DEPENDENCY: forever-agent@0.6.1 (node_modules\fsevents\node_modules\forever-agent):
      npm WARN enoent SKIPPING OPTIONAL DEPENDENCY: ENOENT: no such file or directory, rename 'C:\opt\dev\projects\github\liferay-portal-7.0.x-private\modules\apps\frontend-theme-1975-london\frontend-theme-1975-london\node_modules\fsevents\node_modules\forever-agent' -> 'C:\opt\dev\projects\github\liferay-portal-7.0.x-private\modules\apps\frontend-theme-1975-london\frontend-theme-1975-london\node_modules\fsevents\node_modules\.forever-agent.DELETE'
      npm WARN optional SKIPPING OPTIONAL DEPENDENCY: fs.realpath@1.0.0 (node_modules\fsevents\node_modules\fs.realpath):
      npm WARN enoent SKIPPING OPTIONAL DEPENDENCY: ENOENT: no such file or directory, rename 'C:\opt\dev\projects\github\liferay-portal-7.0.x-private\modules\apps\frontend-theme-1975-london\frontend-theme-1975-london\node_modules\fsevents\node_modules\fs.realpath' -> 'C:\opt\dev\projects\github\liferay-portal-7.0.x-private\modules\apps\frontend-theme-1975-london\frontend-theme-1975-london\node_modules\fsevents\node_modules\.fs.realpath.DELETE'
      npm WARN optional SKIPPING OPTIONAL DEPENDENCY: assert-plus@1.0.0 (node_modules\fsevents\node_modules\getpass\node_modules\assert-plus):
      npm WARN enoent SKIPPING OPTIONAL DEPENDENCY: ENOENT: no such file or directory, rename 'C:\opt\dev\projects\github\liferay-portal-7.0.x-private\modules\apps\frontend-theme-1975-london\frontend-theme-1975-london\node_modules\fsevents\node_modules\getpass\node_modules\assert-plus' -> 'C:\opt\dev\projects\github\liferay-portal-7.0.x-private\modules\apps\frontend-theme-1975-london\frontend-theme-1975-london\node_modules\fsevents\node_modules\getpass\node_modules\.assert-plus.DELETE'
      npm WARN optional SKIPPING OPTIONAL DEPENDENCY: graceful-fs@4.1.11 (node_modules\fsevents\node_modules\graceful-fs):
      npm WARN enoent SKIPPING OPTIONAL DEPENDENCY: ENOENT: no such file or directory, rename 'C:\opt\dev\projects\github\liferay-portal-7.0.x-private\modules\apps\frontend-theme-1975-london\frontend-theme-1975-london\node_modules\fsevents\node_modules\graceful-fs' -> 'C:\opt\dev\projects\github\liferay-portal-7.0.x-private\modules\apps\frontend-theme-1975-london\frontend-theme-1975-london\node_modules\fsevents\node_modules\.graceful-fs.DELETE'
      npm WARN optional SKIPPING OPTIONAL DEPENDENCY: har-schema@1.0.5 (node_modules\fsevents\node_modules\har-schema):
      npm WARN enoent SKIPPING OPTIONAL DEPENDENCY: ENOENT: no such file or directory, rename 'C:\opt\dev\projects\github\liferay-portal-7.0.x-private\modules\apps\frontend-theme-1975-london\frontend-theme-1975-london\node_modules\fsevents\node_modules\har-schema' -> 'C:\opt\dev\projects\github\liferay-portal-7.0.x-private\modules\apps\frontend-theme-1975-london\frontend-theme-1975-london\node_modules\fsevents\node_modules\.har-schema.DELETE'
      npm WARN optional SKIPPING OPTIONAL DEPENDENCY: has-unicode@2.0.1 (node_modules\fsevents\node_modules\has-unicode):
      npm WARN enoent SKIPPING OPTIONAL DEPENDENCY: ENOENT: no such file or directory, rename 'C:\opt\dev\projects\github\liferay-portal-7.0.x-private\modules\apps\frontend-theme-1975-london\frontend-theme-1975-london\node_modules\fsevents\node_modules\has-unicode' -> 'C:\opt\dev\projects\github\liferay-portal-7.0.x-private\modules\apps\frontend-theme-1975-london\frontend-theme-1975-london\node_modules\fsevents\node_modules\.has-unicode.DELETE'
      npm WARN optional SKIPPING OPTIONAL DEPENDENCY: hoek@2.16.3 (node_modules\fsevents\node_modules\hoek):
      npm WARN enoent SKIPPING OPTIONAL DEPENDENCY: ENOENT: no such file or directory, rename 'C:\opt\dev\projects\github\liferay-portal-7.0.x-private\modules\apps\frontend-theme-1975-london\frontend-theme-1975-london\node_modules\fsevents\node_modules\hoek' -> 'C:\opt\dev\projects\github\liferay-portal-7.0.x-private\modules\apps\frontend-theme-1975-london\frontend-theme-1975-london\node_modules\fsevents\node_modules\.hoek.DELETE'
      npm WARN optional SKIPPING OPTIONAL DEPENDENCY: inherits@2.0.3 (node_modules\fsevents\node_modules\inherits):
      npm WARN enoent SKIPPING OPTIONAL DEPENDENCY: ENOENT: no such file or directory, rename 'C:\opt\dev\projects\github\liferay-portal-7.0.x-private\modules\apps\frontend-theme-1975-london\frontend-theme-1975-london\node_modules\fsevents\node_modules\inherits' -> 'C:\opt\dev\projects\github\liferay-portal-7.0.x-private\modules\apps\frontend-theme-1975-london\frontend-theme-1975-london\node_modules\fsevents\node_modules\.inherits.DELETE'
      npm WARN optional SKIPPING OPTIONAL DEPENDENCY: ini@1.3.4 (node_modules\fsevents\node_modules\ini):
      npm WARN enoent SKIPPING OPTIONAL DEPENDENCY: ENOENT: no such file or directory, rename 'C:\opt\dev\projects\github\liferay-portal-7.0.x-private\modules\apps\frontend-theme-1975-london\frontend-theme-1975-london\node_modules\fsevents\node_modules\ini' -> 'C:\opt\dev\projects\github\liferay-portal-7.0.x-private\modules\apps\frontend-theme-1975-london\frontend-theme-1975-london\node_modules\fsevents\node_modules\.ini.DELETE'
      npm WARN optional SKIPPING OPTIONAL DEPENDENCY: is-typedarray@1.0.0 (node_modules\fsevents\node_modules\is-typedarray):
      npm WARN enoent SKIPPING OPTIONAL DEPENDENCY: ENOENT: no such file or directory, rename 'C:\opt\dev\projects\github\liferay-portal-7.0.x-private\modules\apps\frontend-theme-1975-london\frontend-theme-1975-london\node_modules\fsevents\node_modules\is-typedarray' -> 'C:\opt\dev\projects\github\liferay-portal-7.0.x-private\modules\apps\frontend-theme-1975-london\frontend-theme-1975-london\node_modules\fsevents\node_modules\.is-typedarray.DELETE'
      npm WARN optional SKIPPING OPTIONAL DEPENDENCY: isarray@1.0.0 (node_modules\fsevents\node_modules\isarray):
      npm WARN enoent SKIPPING OPTIONAL DEPENDENCY: ENOENT: no such file or directory, rename 'C:\opt\dev\projects\github\liferay-portal-7.0.x-private\modules\apps\frontend-theme-1975-london\frontend-theme-1975-london\node_modules\fsevents\node_modules\isarray' -> 'C:\opt\dev\projects\github\liferay-portal-7.0.x-private\modules\apps\frontend-theme-1975-london\frontend-theme-1975-london\node_modules\fsevents\node_modules\.isarray.DELETE'
      npm WARN optional SKIPPING OPTIONAL DEPENDENCY: isstream@0.1.2 (node_modules\fsevents\node_modules\isstream):
      npm WARN enoent SKIPPING OPTIONAL DEPENDENCY: ENOENT: no such file or directory, rename 'C:\opt\dev\projects\github\liferay-portal-7.0.x-private\modules\apps\frontend-theme-1975-london\frontend-theme-1975-london\node_modules\fsevents\node_modules\isstream' -> 'C:\opt\dev\projects\github\liferay-portal-7.0.x-private\modules\apps\frontend-theme-1975-london\frontend-theme-1975-london\node_modules\fsevents\node_modules\.isstream.DELETE'
      npm WARN optional SKIPPING OPTIONAL DEPENDENCY: jsbn@0.1.1 (node_modules\fsevents\node_modules\jsbn):
      npm WARN enoent SKIPPING OPTIONAL DEPENDENCY: ENOENT: no such file or directory, rename 'C:\opt\dev\projects\github\liferay-portal-7.0.x-private\modules\apps\frontend-theme-1975-london\frontend-theme-1975-london\node_modules\fsevents\node_modules\jsbn' -> 'C:\opt\dev\projects\github\liferay-portal-7.0.x-private\modules\apps\frontend-theme-1975-london\frontend-theme-1975-london\node_modules\fsevents\node_modules\.jsbn.DELETE'
      npm WARN optional SKIPPING OPTIONAL DEPENDENCY: ecc-jsbn@0.1.1 (node_modules\fsevents\node_modules\ecc-jsbn):
      npm WARN enoent SKIPPING OPTIONAL DEPENDENCY: ENOENT: no such file or directory, rename 'C:\opt\dev\projects\github\liferay-portal-7.0.x-private\modules\apps\frontend-theme-1975-london\frontend-theme-1975-london\node_modules\fsevents\node_modules\ecc-jsbn' -> 'C:\opt\dev\projects\github\liferay-portal-7.0.x-private\modules\apps\frontend-theme-1975-london\frontend-theme-1975-london\node_modules\fsevents\node_modules\.ecc-jsbn.DELETE'
      npm WARN optional SKIPPING OPTIONAL DEPENDENCY: jodid25519@1.0.2 (node_modules\fsevents\node_modules\jodid25519):
      npm WARN enoent SKIPPING OPTIONAL DEPENDENCY: ENOENT: no such file or directory, rename 'C:\opt\dev\projects\github\liferay-portal-7.0.x-private\modules\apps\frontend-theme-1975-london\frontend-theme-1975-london\node_modules\fsevents\node_modules\jodid25519' -> 'C:\opt\dev\projects\github\liferay-portal-7.0.x-private\modules\apps\frontend-theme-1975-london\frontend-theme-1975-london\node_modules\fsevents\node_modules\.jodid25519.DELETE'
      npm WARN optional SKIPPING OPTIONAL DEPENDENCY: json-schema@0.2.3 (node_modules\fsevents\node_modules\json-schema):
      npm WARN enoent SKIPPING OPTIONAL DEPENDENCY: ENOENT: no such file or directory, rename 'C:\opt\dev\projects\github\liferay-portal-7.0.x-private\modules\apps\frontend-theme-1975-london\frontend-theme-1975-london\node_modules\fsevents\node_modules\json-schema' -> 'C:\opt\dev\projects\github\liferay-portal-7.0.x-private\modules\apps\frontend-theme-1975-london\frontend-theme-1975-london\node_modules\fsevents\node_modules\.json-schema.DELETE'
      npm WARN optional SKIPPING OPTIONAL DEPENDENCY: json-stringify-safe@5.0.1 (node_modules\fsevents\node_modules\json-stringify-safe):
      npm WARN enoent SKIPPING OPTIONAL DEPENDENCY: ENOENT: no such file or directory, rename 'C:\opt\dev\projects\github\liferay-portal-7.0.x-private\modules\apps\frontend-theme-1975-london\frontend-theme-1975-london\node_modules\fsevents\node_modules\json-stringify-safe' -> 'C:\opt\dev\projects\github\liferay-portal-7.0.x-private\modules\apps\frontend-theme-1975-london\frontend-theme-1975-london\node_modules\fsevents\node_modules\.json-stringify-safe.DELETE'
      npm WARN optional SKIPPING OPTIONAL DEPENDENCY: jsonify@0.0.0 (node_modules\fsevents\node_modules\jsonify):
      npm WARN enoent SKIPPING OPTIONAL DEPENDENCY: ENOENT: no such file or directory, rename 'C:\opt\dev\projects\github\liferay-portal-7.0.x-private\modules\apps\frontend-theme-1975-london\frontend-theme-1975-london\node_modules\fsevents\node_modules\jsonify' -> 'C:\opt\dev\projects\github\liferay-portal-7.0.x-private\modules\apps\frontend-theme-1975-london\frontend-theme-1975-london\node_modules\fsevents\node_modules\.jsonify.DELETE'
      npm WARN optional SKIPPING OPTIONAL DEPENDENCY: assert-plus@1.0.0 (node_modules\fsevents\node_modules\jsprim\node_modules\assert-plus):
      npm WARN enoent SKIPPING OPTIONAL DEPENDENCY: ENOENT: no such file or directory, rename 'C:\opt\dev\projects\github\liferay-portal-7.0.x-private\modules\apps\frontend-theme-1975-london\frontend-theme-1975-london\node_modules\fsevents\node_modules\jsprim\node_modules\assert-plus' -> 'C:\opt\dev\projects\github\liferay-portal-7.0.x-private\modules\apps\frontend-theme-1975-london\frontend-theme-1975-london\node_modules\fsevents\node_modules\jsprim\node_modules\.assert-plus.DELETE'
      npm WARN optional SKIPPING OPTIONAL DEPENDENCY: mime-db@1.27.0 (node_modules\fsevents\node_modules\mime-db):
      npm WARN enoent SKIPPING OPTIONAL DEPENDENCY: ENOENT: no such file or directory, rename 'C:\opt\dev\projects\github\liferay-portal-7.0.x-private\modules\apps\frontend-theme-1975-london\frontend-theme-1975-london\node_modules\fsevents\node_modules\mime-db' -> 'C:\opt\dev\projects\github\liferay-portal-7.0.x-private\modules\apps\frontend-theme-1975-london\frontend-theme-1975-london\node_modules\fsevents\node_modules\.mime-db.DELETE'
      npm WARN optional SKIPPING OPTIONAL DEPENDENCY: minimist@0.0.8 (node_modules\fsevents\node_modules\minimist):
      npm WARN enoent SKIPPING OPTIONAL DEPENDENCY: ENOENT: no such file or directory, rename 'C:\opt\dev\projects\github\liferay-portal-7.0.x-private\modules\apps\frontend-theme-1975-london\frontend-theme-1975-london\node_modules\fsevents\node_modules\minimist' -> 'C:\opt\dev\projects\github\liferay-portal-7.0.x-private\modules\apps\frontend-theme-1975-london\frontend-theme-1975-london\node_modules\fsevents\node_modules\.minimist.DELETE'
      npm WARN optional SKIPPING OPTIONAL DEPENDENCY: ms@2.0.0 (node_modules\fsevents\node_modules\ms):
      npm WARN enoent SKIPPING OPTIONAL DEPENDENCY: ENOENT: no such file or directory, rename 'C:\opt\dev\projects\github\liferay-portal-7.0.x-private\modules\apps\frontend-theme-1975-london\frontend-theme-1975-london\node_modules\fsevents\node_modules\ms' -> 'C:\opt\dev\projects\github\liferay-portal-7.0.x-private\modules\apps\frontend-theme-1975-london\frontend-theme-1975-london\node_modules\fsevents\node_modules\.ms.DELETE'
      npm WARN optional SKIPPING OPTIONAL DEPENDENCY: number-is-nan@1.0.1 (node_modules\fsevents\node_modules\number-is-nan):
      npm WARN enoent SKIPPING OPTIONAL DEPENDENCY: ENOENT: no such file or directory, rename 'C:\opt\dev\projects\github\liferay-portal-7.0.x-private\modules\apps\frontend-theme-1975-london\frontend-theme-1975-london\node_modules\fsevents\node_modules\number-is-nan' -> 'C:\opt\dev\projects\github\liferay-portal-7.0.x-private\modules\apps\frontend-theme-1975-london\frontend-theme-1975-london\node_modules\fsevents\node_modules\.number-is-nan.DELETE'
      npm WARN optional SKIPPING OPTIONAL DEPENDENCY: oauth-sign@0.8.2 (node_modules\fsevents\node_modules\oauth-sign):
      npm WARN enoent SKIPPING OPTIONAL DEPENDENCY: ENOENT: no such file or directory, rename 'C:\opt\dev\projects\github\liferay-portal-7.0.x-private\modules\apps\frontend-theme-1975-london\frontend-theme-1975-london\node_modules\fsevents\node_modules\oauth-sign' -> 'C:\opt\dev\projects\github\liferay-portal-7.0.x-private\modules\apps\frontend-theme-1975-london\frontend-theme-1975-london\node_modules\fsevents\node_modules\.oauth-sign.DELETE'
      npm WARN optional SKIPPING OPTIONAL DEPENDENCY: object-assign@4.1.1 (node_modules\fsevents\node_modules\object-assign):
      npm WARN enoent SKIPPING OPTIONAL DEPENDENCY: ENOENT: no such file or directory, rename 'C:\opt\dev\projects\github\liferay-portal-7.0.x-private\modules\apps\frontend-theme-1975-london\frontend-theme-1975-london\node_modules\fsevents\node_modules\object-assign' -> 'C:\opt\dev\projects\github\liferay-portal-7.0.x-private\modules\apps\frontend-theme-1975-london\frontend-theme-1975-london\node_modules\fsevents\node_modules\.object-assign.DELETE'
      npm WARN optional SKIPPING OPTIONAL DEPENDENCY: os-homedir@1.0.2 (node_modules\fsevents\node_modules\os-homedir):
      npm WARN enoent SKIPPING OPTIONAL DEPENDENCY: ENOENT: no such file or directory, rename 'C:\opt\dev\projects\github\liferay-portal-7.0.x-private\modules\apps\frontend-theme-1975-london\frontend-theme-1975-london\node_modules\fsevents\node_modules\os-homedir' -> 'C:\opt\dev\projects\github\liferay-portal-7.0.x-private\modules\apps\frontend-theme-1975-london\frontend-theme-1975-london\node_modules\fsevents\node_modules\.os-homedir.DELETE'
      npm WARN optional SKIPPING OPTIONAL DEPENDENCY: os-tmpdir@1.0.2 (node_modules\fsevents\node_modules\os-tmpdir):
      npm WARN enoent SKIPPING OPTIONAL DEPENDENCY: ENOENT: no such file or directory, rename 'C:\opt\dev\projects\github\liferay-portal-7.0.x-private\modules\apps\frontend-theme-1975-london\frontend-theme-1975-london\node_modules\fsevents\node_modules\os-tmpdir' -> 'C:\opt\dev\projects\github\liferay-portal-7.0.x-private\modules\apps\frontend-theme-1975-london\frontend-theme-1975-london\node_modules\fsevents\node_modules\.os-tmpdir.DELETE'
      npm WARN optional SKIPPING OPTIONAL DEPENDENCY: path-is-absolute@1.0.1 (node_modules\fsevents\node_modules\path-is-absolute):
      npm WARN enoent SKIPPING OPTIONAL DEPENDENCY: ENOENT: no such file or directory, rename 'C:\opt\dev\projects\github\liferay-portal-7.0.x-private\modules\apps\frontend-theme-1975-london\frontend-theme-1975-london\node_modules\fsevents\node_modules\path-is-absolute' -> 'C:\opt\dev\projects\github\liferay-portal-7.0.x-private\modules\apps\frontend-theme-1975-london\frontend-theme-1975-london\node_modules\fsevents\node_modules\.path-is-absolute.DELETE'
      npm WARN optional SKIPPING OPTIONAL DEPENDENCY: performance-now@0.2.0 (node_modules\fsevents\node_modules\performance-now):
      npm WARN enoent SKIPPING OPTIONAL DEPENDENCY: ENOENT: no such file or directory, rename 'C:\opt\dev\projects\github\liferay-portal-7.0.x-private\modules\apps\frontend-theme-1975-london\frontend-theme-1975-london\node_modules\fsevents\node_modules\performance-now' -> 'C:\opt\dev\projects\github\liferay-portal-7.0.x-private\modules\apps\frontend-theme-1975-london\frontend-theme-1975-london\node_modules\fsevents\node_modules\.performance-now.DELETE'
      npm WARN optional SKIPPING OPTIONAL DEPENDENCY: process-nextick-args@1.0.7 (node_modules\fsevents\node_modules\process-nextick-args):
      npm WARN enoent SKIPPING OPTIONAL DEPENDENCY: ENOENT: no such file or directory, rename 'C:\opt\dev\projects\github\liferay-portal-7.0.x-private\modules\apps\frontend-theme-1975-london\frontend-theme-1975-london\node_modules\fsevents\node_modules\process-nextick-args' -> 'C:\opt\dev\projects\github\liferay-portal-7.0.x-private\modules\apps\frontend-theme-1975-london\frontend-theme-1975-london\node_modules\fsevents\node_modules\.process-nextick-args.DELETE'
      npm WARN optional SKIPPING OPTIONAL DEPENDENCY: punycode@1.4.1 (node_modules\fsevents\node_modules\punycode):
      npm WARN enoent SKIPPING OPTIONAL DEPENDENCY: ENOENT: no such file or directory, rename 'C:\opt\dev\projects\github\liferay-portal-7.0.x-private\modules\apps\frontend-theme-1975-london\frontend-theme-1975-london\node_modules\fsevents\node_modules\punycode' -> 'C:\opt\dev\projects\github\liferay-portal-7.0.x-private\modules\apps\frontend-theme-1975-london\frontend-theme-1975-london\node_modules\fsevents\node_modules\.punycode.DELETE'
      npm WARN optional SKIPPING OPTIONAL DEPENDENCY: qs@6.4.0 (node_modules\fsevents\node_modules\qs):
      npm WARN enoent SKIPPING OPTIONAL DEPENDENCY: ENOENT: no such file or directory, rename 'C:\opt\dev\projects\github\liferay-portal-7.0.x-private\modules\apps\frontend-theme-1975-london\frontend-theme-1975-london\node_modules\fsevents\node_modules\qs' -> 'C:\opt\dev\projects\github\liferay-portal-7.0.x-private\modules\apps\frontend-theme-1975-london\frontend-theme-1975-london\node_modules\fsevents\node_modules\.qs.DELETE'
      npm WARN optional SKIPPING OPTIONAL DEPENDENCY: minimist@1.2.0 (node_modules\fsevents\node_modules\rc\node_modules\minimist):
      npm WARN enoent SKIPPING OPTIONAL DEPENDENCY: ENOENT: no such file or directory, rename 'C:\opt\dev\projects\github\liferay-portal-7.0.x-private\modules\apps\frontend-theme-1975-london\frontend-theme-1975-london\node_modules\fsevents\node_modules\rc\node_modules\minimist' -> 'C:\opt\dev\projects\github\liferay-portal-7.0.x-private\modules\apps\frontend-theme-1975-london\frontend-theme-1975-london\node_modules\fsevents\node_modules\rc\node_modules\.minimist.DELETE'
      npm WARN optional SKIPPING OPTIONAL DEPENDENCY: safe-buffer@5.0.1 (node_modules\fsevents\node_modules\safe-buffer):
      npm WARN enoent SKIPPING OPTIONAL DEPENDENCY: ENOENT: no such file or directory, rename 'C:\opt\dev\projects\github\liferay-portal-7.0.x-private\modules\apps\frontend-theme-1975-london\frontend-theme-1975-london\node_modules\fsevents\node_modules\safe-buffer' -> 'C:\opt\dev\projects\github\liferay-portal-7.0.x-private\modules\apps\frontend-theme-1975-london\frontend-theme-1975-london\node_modules\fsevents\node_modules\.safe-buffer.DELETE'
      npm WARN optional SKIPPING OPTIONAL DEPENDENCY: semver@5.3.0 (node_modules\fsevents\node_modules\semver):
      npm WARN enoent SKIPPING OPTIONAL DEPENDENCY: ENOENT: no such file or directory, rename 'C:\opt\dev\projects\github\liferay-portal-7.0.x-private\modules\apps\frontend-theme-1975-london\frontend-theme-1975-london\node_modules\fsevents\node_modules\semver' -> 'C:\opt\dev\projects\github\liferay-portal-7.0.x-private\modules\apps\frontend-theme-1975-london\frontend-theme-1975-london\node_modules\fsevents\node_modules\.semver.DELETE'
      npm WARN optional SKIPPING OPTIONAL DEPENDENCY: set-blocking@2.0.0 (node_modules\fsevents\node_modules\set-blocking):
      npm WARN enoent SKIPPING OPTIONAL DEPENDENCY: ENOENT: no such file or directory, rename 'C:\opt\dev\projects\github\liferay-portal-7.0.x-private\modules\apps\frontend-theme-1975-london\frontend-theme-1975-london\node_modules\fsevents\node_modules\set-blocking' -> 'C:\opt\dev\projects\github\liferay-portal-7.0.x-private\modules\apps\frontend-theme-1975-london\frontend-theme-1975-london\node_modules\fsevents\node_modules\.set-blocking.DELETE'
      npm WARN optional SKIPPING OPTIONAL DEPENDENCY: signal-exit@3.0.2 (node_modules\fsevents\node_modules\signal-exit):
      npm WARN enoent SKIPPING OPTIONAL DEPENDENCY: ENOENT: no such file or directory, rename 'C:\opt\dev\projects\github\liferay-portal-7.0.x-private\modules\apps\frontend-theme-1975-london\frontend-theme-1975-london\node_modules\fsevents\node_modules\signal-exit' -> 'C:\opt\dev\projects\github\liferay-portal-7.0.x-private\modules\apps\frontend-theme-1975-london\frontend-theme-1975-london\node_modules\fsevents\node_modules\.signal-exit.DELETE'
      npm WARN optional SKIPPING OPTIONAL DEPENDENCY: assert-plus@1.0.0 (node_modules\fsevents\node_modules\sshpk\node_modules\assert-plus):
      npm WARN enoent SKIPPING OPTIONAL DEPENDENCY: ENOENT: no such file or directory, rename 'C:\opt\dev\projects\github\liferay-portal-7.0.x-private\modules\apps\frontend-theme-1975-london\frontend-theme-1975-london\node_modules\fsevents\node_modules\sshpk\node_modules\assert-plus' -> 'C:\opt\dev\projects\github\liferay-portal-7.0.x-private\modules\apps\frontend-theme-1975-london\frontend-theme-1975-london\node_modules\fsevents\node_modules\sshpk\node_modules\.assert-plus.DELETE'
      npm WARN optional SKIPPING OPTIONAL DEPENDENCY: stringstream@0.0.5 (node_modules\fsevents\node_modules\stringstream):
      npm WARN enoent SKIPPING OPTIONAL DEPENDENCY: ENOENT: no such file or directory, rename 'C:\opt\dev\projects\github\liferay-portal-7.0.x-private\modules\apps\frontend-theme-1975-london\frontend-theme-1975-london\node_modules\fsevents\node_modules\stringstream' -> 'C:\opt\dev\projects\github\liferay-portal-7.0.x-private\modules\apps\frontend-theme-1975-london\frontend-theme-1975-london\node_modules\fsevents\node_modules\.stringstream.DELETE'
      npm WARN optional SKIPPING OPTIONAL DEPENDENCY: strip-json-comments@2.0.1 (node_modules\fsevents\node_modules\strip-json-comments):
      npm WARN enoent SKIPPING OPTIONAL DEPENDENCY: ENOENT: no such file or directory, rename 'C:\opt\dev\projects\github\liferay-portal-7.0.x-private\modules\apps\frontend-theme-1975-london\frontend-theme-1975-london\node_modules\fsevents\node_modules\strip-json-comments' -> 'C:\opt\dev\projects\github\liferay-portal-7.0.x-private\modules\apps\frontend-theme-1975-london\frontend-theme-1975-london\node_modules\fsevents\node_modules\.strip-json-comments.DELETE'
      npm WARN optional SKIPPING OPTIONAL DEPENDENCY: tweetnacl@0.14.5 (node_modules\fsevents\node_modules\tweetnacl):
      npm WARN enoent SKIPPING OPTIONAL DEPENDENCY: ENOENT: no such file or directory, rename 'C:\opt\dev\projects\github\liferay-portal-7.0.x-private\modules\apps\frontend-theme-1975-london\frontend-theme-1975-london\node_modules\fsevents\node_modules\tweetnacl' -> 'C:\opt\dev\projects\github\liferay-portal-7.0.x-private\modules\apps\frontend-theme-1975-london\frontend-theme-1975-london\node_modules\fsevents\node_modules\.tweetnacl.DELETE'
      npm WARN optional SKIPPING OPTIONAL DEPENDENCY: bcrypt-pbkdf@1.0.1 (node_modules\fsevents\node_modules\bcrypt-pbkdf):
      npm WARN enoent SKIPPING OPTIONAL DEPENDENCY: ENOENT: no such file or directory, rename 'C:\opt\dev\projects\github\liferay-portal-7.0.x-private\modules\apps\frontend-theme-1975-london\frontend-theme-1975-london\node_modules\fsevents\node_modules\bcrypt-pbkdf' -> 'C:\opt\dev\projects\github\liferay-portal-7.0.x-private\modules\apps\frontend-theme-1975-london\frontend-theme-1975-london\node_modules\fsevents\node_modules\.bcrypt-pbkdf.DELETE'
      npm WARN optional SKIPPING OPTIONAL DEPENDENCY: uid-number@0.0.6 (node_modules\fsevents\node_modules\uid-number):
      npm WARN enoent SKIPPING OPTIONAL DEPENDENCY: ENOENT: no such file or directory, rename 'C:\opt\dev\projects\github\liferay-portal-7.0.x-private\modules\apps\frontend-theme-1975-london\frontend-theme-1975-london\node_modules\fsevents\node_modules\uid-number' -> 'C:\opt\dev\projects\github\liferay-portal-7.0.x-private\modules\apps\frontend-theme-1975-london\frontend-theme-1975-london\node_modules\fsevents\node_modules\.uid-number.DELETE'
      npm WARN optional SKIPPING OPTIONAL DEPENDENCY: util-deprecate@1.0.2 (node_modules\fsevents\node_modules\util-deprecate):
      npm WARN enoent SKIPPING OPTIONAL DEPENDENCY: ENOENT: no such file or directory, rename 'C:\opt\dev\projects\github\liferay-portal-7.0.x-private\modules\apps\frontend-theme-1975-london\frontend-theme-1975-london\node_modules\fsevents\node_modules\util-deprecate' -> 'C:\opt\dev\projects\github\liferay-portal-7.0.x-private\modules\apps\frontend-theme-1975-london\frontend-theme-1975-london\node_modules\fsevents\node_modules\.util-deprecate.DELETE'
      npm WARN optional SKIPPING OPTIONAL DEPENDENCY: uuid@3.0.1 (node_modules\fsevents\node_modules\uuid):
      npm WARN enoent SKIPPING OPTIONAL DEPENDENCY: ENOENT: no such file or directory, rename 'C:\opt\dev\projects\github\liferay-portal-7.0.x-private\modules\apps\frontend-theme-1975-london\frontend-theme-1975-london\node_modules\fsevents\node_modules\uuid' -> 'C:\opt\dev\projects\github\liferay-portal-7.0.x-private\modules\apps\frontend-theme-1975-london\frontend-theme-1975-london\node_modules\fsevents\node_modules\.uuid.DELETE'
      npm WARN optional SKIPPING OPTIONAL DEPENDENCY: wrappy@1.0.2 (node_modules\fsevents\node_modules\wrappy):
      npm WARN enoent SKIPPING OPTIONAL DEPENDENCY: ENOENT: no such file or directory, rename 'C:\opt\dev\projects\github\liferay-portal-7.0.x-private\modules\apps\frontend-theme-1975-london\frontend-theme-1975-london\node_modules\fsevents\node_modules\wrappy' -> 'C:\opt\dev\projects\github\liferay-portal-7.0.x-private\modules\apps\frontend-theme-1975-london\frontend-theme-1975-london\node_modules\fsevents\node_modules\.wrappy.DELETE'
      
      npm ERR! code ELIFECYCLE
      npm ERR! errno 1
      npm ERR! coffee-script@1.12.8 postinstall: `node --eval 'if (require("./package.json").name === "coffee-script") { var red, yellow, cyan, reset; red = yellow = cyan = reset = ""; if (!process.env.NODE_DISABLE_COLORS) { red = "\x1b[31m"; yellow = "\x1b[33m"; cyan = "\x1b[36m"; reset = "\x1b[0m"; } console.warn(red + "CoffeeScript has moved!" + reset + " Please update references to " + yellow + "\"coffee-script\"" + reset + " to use " + yellow + "\"coffeescript\"" + reset + " (no hyphen) instead."); console.warn("Also, a new major version has been released under the " + yellow + "coffeescript" + reset + " name on NPM. This new release targets modern JavaScript, with minimal breaking changes. Learn more at " + cyan + "http://coffeescript.org" + reset + "."); console.warn(""); }'`
      npm ERR! Exit status 1
      npm ERR! 
      npm ERR! Failed at the coffee-script@1.12.8 postinstall script.
      npm ERR! This is probably not a problem with npm. There is likely additional logging output above.
      
      npm ERR! A complete log of this run can be found in:
      npm ERR!     C:\Users\Administrator\AppData\Roaming\npm-cache\_logs\2018-03-30T20_46_36_295Z-debug.log
      :apps:frontend-theme-1975-london:frontend-theme-1975-london:npmInstall FAILED
      npm WARN deprecated minimatch@2.0.10: Please update to minimatch 3.0.2 or higher to avoid a RegExp DoS issue
      npm WARN deprecated minimatch@0.2.14: Please update to minimatch 3.0.2 or higher to avoid a RegExp DoS issue
      npm WARN deprecated graceful-fs@1.2.3: graceful-fs v3.0.0 and before will fail on node releases >= v7.0. Please update to graceful-fs@^4.0.0 as soon as possible. Use 'npm ls graceful-fs' to find it in the tree.
      
      > node-sass@3.13.1 install C:\opt\dev\projects\github\liferay-portal-7.0.x-private\modules\apps\frontend-theme-fjord\frontend-theme-fjord\node_modules\node-sass
      > node scripts/install.js
      
      Cached binary found at C:\Users\Administrator\AppData\Roaming\npm-cache\node-sass\3.13.1\win32-x64-48_binding.node
      
      > liferay-theme-deps-7.0@1.0.0 install C:\opt\dev\projects\github\liferay-portal-7.0.x-private\modules\apps\frontend-theme-fjord\frontend-theme-fjord\node_modules\liferay-theme-deps-7.0
      > node scripts/install.js
      
      
      > coffee-script@1.12.8 postinstall C:\opt\dev\projects\github\liferay-portal-7.0.x-private\modules\apps\frontend-theme-fjord\frontend-theme-fjord\node_modules\coffee-script
      > node --eval 'if (require("./package.json").name === "coffee-script") { var red, yellow, cyan, reset; red = yellow = cyan = reset = ""; if (!process.env.NODE_DISABLE_COLORS) { red = "\x1b[31m"; yellow = "\x1b[33m"; cyan = "\x1b[36m"; reset = "\x1b[0m"; } console.warn(red + "CoffeeScript has moved!" + reset + " Please update references to " + yellow + "\"coffee-script\"" + reset + " to use " + yellow + "\"coffeescript\"" + reset + " (no hyphen) instead."); console.warn("Also, a new major version has been released under the " + yellow + "coffeescript" + reset + " name on NPM. This new release targets modern JavaScript, with minimal breaking changes. Learn more at " + cyan + "http://coffeescript.org" + reset + "."); console.warn(""); }'
      
      [eval]:1
      'if
      ^^^
      SyntaxError: Invalid or unexpected token
          at Object.exports.runInThisContext (vm.js:76:16)
          at Object.<anonymous> ([eval]-wrapper:6:22)
          at Module._compile (module.js:556:32)
          at bootstrap_node.js:357:29
          at _combinedTickCallback (internal/process/next_tick.js:67:7)
          at process._tickCallback (internal/process/next_tick.js:98:9)
      npm WARN liferay-fjord-theme@1.0.35 No description
      npm WARN liferay-fjord-theme@1.0.35 license should be a valid SPDX license expression
      
      npm ERR! code ELIFECYCLE
      npm ERR! errno 1
      npm ERR! coffee-script@1.12.8 postinstall: `node --eval 'if (require("./package.json").name === "coffee-script") { var red, yellow, cyan, reset; red = yellow = cyan = reset = ""; if (!process.env.NODE_DISABLE_COLORS) { red = "\x1b[31m"; yellow = "\x1b[33m"; cyan = "\x1b[36m"; reset = "\x1b[0m"; } console.warn(red + "CoffeeScript has moved!" + reset + " Please update references to " + yellow + "\"coffee-script\"" + reset + " to use " + yellow + "\"coffeescript\"" + reset + " (no hyphen) instead."); console.warn("Also, a new major version has been released under the " + yellow + "coffeescript" + reset + " name on NPM. This new release targets modern JavaScript, with minimal breaking changes. Learn more at " + cyan + "http://coffeescript.org" + reset + "."); console.warn(""); }'`
      npm ERR! Exit status 1
      npm ERR! 
      npm ERR! Failed at the coffee-script@1.12.8 postinstall script.
      npm ERR! This is probably not a problem with npm. There is likely additional logging output above.
      
      npm ERR! A complete log of this run can be found in:
      npm ERR!     C:\Users\Administrator\AppData\Roaming\npm-cache\_logs\2018-03-30T20_47_37_824Z-debug.log
      Process '[cmd, /c, ""C:\opt\dev\projects\github\liferay-portal-7.0.x-private\modules\apps\frontend-theme-fjord\frontend-theme-fjord\build_gradle\node\node" "C:/opt/dev/projects/github/liferay-portal-7.0.x-private/modules/apps/frontend-theme-fjord/frontend-theme-fjord/build_gradle/node/node_modules/npm/bin/npm-cli.js" "--loglevel" "warn" "--progress" "true" "--registry" "http://mirrors.lax.liferay.com:4873" "install""]' finished with non-zero exit value 1. Running "npm install" again
      npm WARN deprecated minimatch@2.0.10: Please update to minimatch 3.0.2 or higher to avoid a RegExp DoS issue
      npm WARN deprecated minimatch@0.2.14: Please update to minimatch 3.0.2 or higher to avoid a RegExp DoS issue
      npm WARN deprecated graceful-fs@1.2.3: graceful-fs v3.0.0 and before will fail on node releases >= v7.0. Please update to graceful-fs@^4.0.0 as soon as possible. Use 'npm ls graceful-fs' to find it in the tree.
      
      > node-sass@3.13.1 install C:\opt\dev\projects\github\liferay-portal-7.0.x-private\modules\apps\frontend-theme-fjord\frontend-theme-fjord\node_modules\node-sass
      > node scripts/install.js
      
      Cached binary found at C:\Users\Administrator\AppData\Roaming\npm-cache\node-sass\3.13.1\win32-x64-48_binding.node
      
      > liferay-theme-deps-7.0@1.0.0 install C:\opt\dev\projects\github\liferay-portal-7.0.x-private\modules\apps\frontend-theme-fjord\frontend-theme-fjord\node_modules\liferay-theme-deps-7.0
      > node scripts/install.js
      
      
      > coffee-script@1.12.8 postinstall C:\opt\dev\projects\github\liferay-portal-7.0.x-private\modules\apps\frontend-theme-fjord\frontend-theme-fjord\node_modules\coffee-script
      > node --eval 'if (require("./package.json").name === "coffee-script") { var red, yellow, cyan, reset; red = yellow = cyan = reset = ""; if (!process.env.NODE_DISABLE_COLORS) { red = "\x1b[31m"; yellow = "\x1b[33m"; cyan = "\x1b[36m"; reset = "\x1b[0m"; } console.warn(red + "CoffeeScript has moved!" + reset + " Please update references to " + yellow + "\"coffee-script\"" + reset + " to use " + yellow + "\"coffeescript\"" + reset + " (no hyphen) instead."); console.warn("Also, a new major version has been released under the " + yellow + "coffeescript" + reset + " name on NPM. This new release targets modern JavaScript, with minimal breaking changes. Learn more at " + cyan + "http://coffeescript.org" + reset + "."); console.warn(""); }'
      
      [eval]:1
      'if
      ^^^
      SyntaxError: Invalid or unexpected token
          at Object.exports.runInThisContext (vm.js:76:16)
          at Object.<anonymous> ([eval]-wrapper:6:22)
          at Module._compile (module.js:556:32)
          at bootstrap_node.js:357:29
          at _combinedTickCallback (internal/process/next_tick.js:67:7)
          at process._tickCallback (internal/process/next_tick.js:98:9)
      npm WARN liferay-fjord-theme@1.0.35 No description
      npm WARN liferay-fjord-theme@1.0.35 license should be a valid SPDX license expression
      
      npm ERR! code ELIFECYCLE
      npm ERR! errno 1
      npm ERR! coffee-script@1.12.8 postinstall: `node --eval 'if (require("./package.json").name === "coffee-script") { var red, yellow, cyan, reset; red = yellow = cyan = reset = ""; if (!process.env.NODE_DISABLE_COLORS) { red = "\x1b[31m"; yellow = "\x1b[33m"; cyan = "\x1b[36m"; reset = "\x1b[0m"; } console.warn(red + "CoffeeScript has moved!" + reset + " Please update references to " + yellow + "\"coffee-script\"" + reset + " to use " + yellow + "\"coffeescript\"" + reset + " (no hyphen) instead."); console.warn("Also, a new major version has been released under the " + yellow + "coffeescript" + reset + " name on NPM. This new release targets modern JavaScript, with minimal breaking changes. Learn more at " + cyan + "http://coffeescript.org" + reset + "."); console.warn(""); }'`
      npm ERR! Exit status 1
      npm ERR! 
      npm ERR! Failed at the coffee-script@1.12.8 postinstall script.
      npm ERR! This is probably not a problem with npm. There is likely additional logging output above.
      
      npm ERR! A complete log of this run can be found in:
      npm ERR!     C:\Users\Administrator\AppData\Roaming\npm-cache\_logs\2018-03-30T20_50_11_230Z-debug.log
      Process '[cmd, /c, ""C:\opt\dev\projects\github\liferay-portal-7.0.x-private\modules\apps\frontend-theme-fjord\frontend-theme-fjord\build_gradle\node\node" "C:/opt/dev/projects/github/liferay-portal-7.0.x-private/modules/apps/frontend-theme-fjord/frontend-theme-fjord/build_gradle/node/node_modules/npm/bin/npm-cli.js" "--loglevel" "warn" "--progress" "true" "--registry" "http://mirrors.lax.liferay.com:4873" "install""]' finished with non-zero exit value 1. Running "npm install" again
      npm WARN deprecated minimatch@2.0.10: Please update to minimatch 3.0.2 or higher to avoid a RegExp DoS issue
      npm WARN deprecated minimatch@0.2.14: Please update to minimatch 3.0.2 or higher to avoid a RegExp DoS issue
      npm WARN deprecated graceful-fs@1.2.3: graceful-fs v3.0.0 and before will fail on node releases >= v7.0. Please update to graceful-fs@^4.0.0 as soon as possible. Use 'npm ls graceful-fs' to find it in the tree.
      
      > node-sass@3.13.1 install C:\opt\dev\projects\github\liferay-portal-7.0.x-private\modules\apps\frontend-theme-fjord\frontend-theme-fjord\node_modules\node-sass
      > node scripts/install.js
      
      Cached binary found at C:\Users\Administrator\AppData\Roaming\npm-cache\node-sass\3.13.1\win32-x64-48_binding.node
      
      > liferay-theme-deps-7.0@1.0.0 install C:\opt\dev\projects\github\liferay-portal-7.0.x-private\modules\apps\frontend-theme-fjord\frontend-theme-fjord\node_modules\liferay-theme-deps-7.0
      > node scripts/install.js
      
      
      > coffee-script@1.12.8 postinstall C:\opt\dev\projects\github\liferay-portal-7.0.x-private\modules\apps\frontend-theme-fjord\frontend-theme-fjord\node_modules\coffee-script
      > node --eval 'if (require("./package.json").name === "coffee-script") { var red, yellow, cyan, reset; red = yellow = cyan = reset = ""; if (!process.env.NODE_DISABLE_COLORS) { red = "\x1b[31m"; yellow = "\x1b[33m"; cyan = "\x1b[36m"; reset = "\x1b[0m"; } console.warn(red + "CoffeeScript has moved!" + reset + " Please update references to " + yellow + "\"coffee-script\"" + reset + " to use " + yellow + "\"coffeescript\"" + reset + " (no hyphen) instead."); console.warn("Also, a new major version has been released under the " + yellow + "coffeescript" + reset + " name on NPM. This new release targets modern JavaScript, with minimal breaking changes. Learn more at " + cyan + "http://coffeescript.org" + reset + "."); console.warn(""); }'
      
      [eval]:1
      'if
      ^^^
      SyntaxError: Invalid or unexpected token
          at Object.exports.runInThisContext (vm.js:76:16)
          at Object.<anonymous> ([eval]-wrapper:6:22)
          at Module._compile (module.js:556:32)
          at bootstrap_node.js:357:29
          at _combinedTickCallback (internal/process/next_tick.js:67:7)
          at process._tickCallback (internal/process/next_tick.js:98:9)
      npm WARN liferay-fjord-theme@1.0.35 No description
      npm WARN liferay-fjord-theme@1.0.35 license should be a valid SPDX license expression
      
      npm ERR! code ELIFECYCLE
      npm ERR! errno 1
      npm ERR! coffee-script@1.12.8 postinstall: `node --eval 'if (require("./package.json").name === "coffee-script") { var red, yellow, cyan, reset; red = yellow = cyan = reset = ""; if (!process.env.NODE_DISABLE_COLORS) { red = "\x1b[31m"; yellow = "\x1b[33m"; cyan = "\x1b[36m"; reset = "\x1b[0m"; } console.warn(red + "CoffeeScript has moved!" + reset + " Please update references to " + yellow + "\"coffee-script\"" + reset + " to use " + yellow + "\"coffeescript\"" + reset + " (no hyphen) instead."); console.warn("Also, a new major version has been released under the " + yellow + "coffeescript" + reset + " name on NPM. This new release targets modern JavaScript, with minimal breaking changes. Learn more at " + cyan + "http://coffeescript.org" + reset + "."); console.warn(""); }'`
      npm ERR! Exit status 1
      npm ERR! 
      npm ERR! Failed at the coffee-script@1.12.8 postinstall script.
      npm ERR! This is probably not a problem with npm. There is likely additional logging output above.
      
      npm ERR! A complete log of this run can be found in:
      npm ERR!     C:\Users\Administrator\AppData\Roaming\npm-cache\_logs\2018-03-30T20_52_36_601Z-debug.log
      Process '[cmd, /c, ""C:\opt\dev\projects\github\liferay-portal-7.0.x-private\modules\apps\frontend-theme-fjord\frontend-theme-fjord\build_gradle\node\node" "C:/opt/dev/projects/github/liferay-portal-7.0.x-private/modules/apps/frontend-theme-fjord/frontend-theme-fjord/build_gradle/node/node_modules/npm/bin/npm-cli.js" "--loglevel" "warn" "--progress" "true" "--registry" "http://mirrors.lax.liferay.com:4873" "install""]' finished with non-zero exit value 1. Running "npm install" again
      npm WARN deprecated minimatch@2.0.10: Please update to minimatch 3.0.2 or higher to avoid a RegExp DoS issue
      npm WARN deprecated minimatch@0.2.14: Please update to minimatch 3.0.2 or higher to avoid a RegExp DoS issue
      npm WARN deprecated graceful-fs@1.2.3: graceful-fs v3.0.0 and before will fail on node releases >= v7.0. Please update to graceful-fs@^4.0.0 as soon as possible. Use 'npm ls graceful-fs' to find it in the tree.
      
      > node-sass@3.13.1 install C:\opt\dev\projects\github\liferay-portal-7.0.x-private\modules\apps\frontend-theme-fjord\frontend-theme-fjord\node_modules\node-sass
      > node scripts/install.js
      
      Cached binary found at C:\Users\Administrator\AppData\Roaming\npm-cache\node-sass\3.13.1\win32-x64-48_binding.node
      
      > liferay-theme-deps-7.0@1.0.0 install C:\opt\dev\projects\github\liferay-portal-7.0.x-private\modules\apps\frontend-theme-fjord\frontend-theme-fjord\node_modules\liferay-theme-deps-7.0
      > node scripts/install.js
      
      
      > coffee-script@1.12.8 postinstall C:\opt\dev\projects\github\liferay-portal-7.0.x-private\modules\apps\frontend-theme-fjord\frontend-theme-fjord\node_modules\coffee-script
      > node --eval 'if (require("./package.json").name === "coffee-script") { var red, yellow, cyan, reset; red = yellow = cyan = reset = ""; if (!process.env.NODE_DISABLE_COLORS) { red = "\x1b[31m"; yellow = "\x1b[33m"; cyan = "\x1b[36m"; reset = "\x1b[0m"; } console.warn(red + "CoffeeScript has moved!" + reset + " Please update references to " + yellow + "\"coffee-script\"" + reset + " to use " + yellow + "\"coffeescript\"" + reset + " (no hyphen) instead."); console.warn("Also, a new major version has been released under the " + yellow + "coffeescript" + reset + " name on NPM. This new release targets modern JavaScript, with minimal breaking changes. Learn more at " + cyan + "http://coffeescript.org" + reset + "."); console.warn(""); }'
      
      [eval]:1
      'if
      ^^^
      SyntaxError: Invalid or unexpected token
          at Object.exports.runInThisContext (vm.js:76:16)
          at Object.<anonymous> ([eval]-wrapper:6:22)
          at Module._compile (module.js:556:32)
          at bootstrap_node.js:357:29
          at _combinedTickCallback (internal/process/next_tick.js:67:7)
          at process._tickCallback (internal/process/next_tick.js:98:9)
      npm WARN liferay-fjord-theme@1.0.35 No description
      npm WARN liferay-fjord-theme@1.0.35 license should be a valid SPDX license expression
      
      npm ERR! code ELIFECYCLE
      npm ERR! errno 1
      npm ERR! coffee-script@1.12.8 postinstall: `node --eval 'if (require("./package.json").name === "coffee-script") { var red, yellow, cyan, reset; red = yellow = cyan = reset = ""; if (!process.env.NODE_DISABLE_COLORS) { red = "\x1b[31m"; yellow = "\x1b[33m"; cyan = "\x1b[36m"; reset = "\x1b[0m"; } console.warn(red + "CoffeeScript has moved!" + reset + " Please update references to " + yellow + "\"coffee-script\"" + reset + " to use " + yellow + "\"coffeescript\"" + reset + " (no hyphen) instead."); console.warn("Also, a new major version has been released under the " + yellow + "coffeescript" + reset + " name on NPM. This new release targets modern JavaScript, with minimal breaking changes. Learn more at " + cyan + "http://coffeescript.org" + reset + "."); console.warn(""); }'`
      npm ERR! Exit status 1
      npm ERR! 
      npm ERR! Failed at the coffee-script@1.12.8 postinstall script.
      npm ERR! This is probably not a problem with npm. There is likely additional logging output above.
      
      npm ERR! A complete log of this run can be found in:
      npm ERR!     C:\Users\Administrator\AppData\Roaming\npm-cache\_logs\2018-03-30T20_54_55_435Z-debug.log
      :apps:frontend-theme-fjord:frontend-theme-fjord:npmInstall FAILED
      
      FAILURE: Build completed with 2 failures.
      
      1: Task failed with an exception.
      -----------
      * What went wrong:
      Execution failed for task ':apps:frontend-theme-1975-london:frontend-theme-1975-london:npmInstall'.
      > java.io.IOException: Process '[cmd, /c, ""C:\opt\dev\projects\github\liferay-portal-7.0.x-private\modules\apps\frontend-theme-1975-london\frontend-theme-1975-london\build_gradle\node\node" "C:/opt/dev/projects/github/liferay-portal-7.0.x-private/modules/apps/frontend-theme-1975-london/frontend-theme-1975-london/build_gradle/node/node_modules/npm/bin/npm-cli.js" "--loglevel" "warn" "--progress" "true" "--registry" "http://mirrors.lax.liferay.com:4873" "install""]' finished with non-zero exit value 1
      
      * Try:
      Run with --info or --debug option to get more log output.
      
      * Exception is:
      org.gradle.api.tasks.TaskExecutionException: Execution failed for task ':apps:frontend-theme-1975-london:frontend-theme-1975-london:npmInstall'.
         at org.gradle.api.internal.tasks.execution.ExecuteActionsTaskExecuter.executeActions(ExecuteActionsTaskExecuter.java:84)
         at org.gradle.api.internal.tasks.execution.ExecuteActionsTaskExecuter.execute(ExecuteActionsTaskExecuter.java:55)
         at org.gradle.api.internal.tasks.execution.SkipUpToDateTaskExecuter.execute(SkipUpToDateTaskExecuter.java:62)
         at org.gradle.api.internal.tasks.execution.ValidatingTaskExecuter.execute(ValidatingTaskExecuter.java:58)
         at org.gradle.api.internal.tasks.execution.SkipEmptySourceFilesTaskExecuter.execute(SkipEmptySourceFilesTaskExecuter.java:88)
         at org.gradle.api.internal.tasks.execution.ResolveTaskArtifactStateTaskExecuter.execute(ResolveTaskArtifactStateTaskExecuter.java:46)
         at org.gradle.api.internal.tasks.execution.SkipTaskWithNoActionsExecuter.execute(SkipTaskWithNoActionsExecuter.java:51)
         at org.gradle.api.internal.tasks.execution.SkipOnlyIfTaskExecuter.execute(SkipOnlyIfTaskExecuter.java:54)
         at org.gradle.api.internal.tasks.execution.ExecuteAtMostOnceTaskExecuter.execute(ExecuteAtMostOnceTaskExecuter.java:43)
         at org.gradle.api.internal.tasks.execution.CatchExceptionTaskExecuter.execute(CatchExceptionTaskExecuter.java:34)
         at org.gradle.execution.taskgraph.DefaultTaskGraphExecuter$EventFiringTaskWorker$1.execute(DefaultTaskGraphExecuter.java:236)
         at org.gradle.execution.taskgraph.DefaultTaskGraphExecuter$EventFiringTaskWorker$1.execute(DefaultTaskGraphExecuter.java:228)
         at org.gradle.internal.Transformers$4.transform(Transformers.java:169)
         at org.gradle.internal.progress.DefaultBuildOperationExecutor.run(DefaultBuildOperationExecutor.java:106)
         at org.gradle.internal.progress.DefaultBuildOperationExecutor.run(DefaultBuildOperationExecutor.java:61)
         at org.gradle.execution.taskgraph.DefaultTaskGraphExecuter$EventFiringTaskWorker.execute(DefaultTaskGraphExecuter.java:228)
         at org.gradle.execution.taskgraph.DefaultTaskGraphExecuter$EventFiringTaskWorker.execute(DefaultTaskGraphExecuter.java:215)
         at org.gradle.execution.taskgraph.AbstractTaskPlanExecutor$TaskExecutorWorker.processTask(AbstractTaskPlanExecutor.java:77)
         at org.gradle.execution.taskgraph.AbstractTaskPlanExecutor$TaskExecutorWorker.run(AbstractTaskPlanExecutor.java:58)
         at org.gradle.execution.taskgraph.ParallelTaskPlanExecutor.process(ParallelTaskPlanExecutor.java:50)
         at org.gradle.execution.taskgraph.DefaultTaskGraphExecuter.execute(DefaultTaskGraphExecuter.java:113)
         at org.gradle.execution.SelectedTaskExecutionAction.execute(SelectedTaskExecutionAction.java:37)
         at org.gradle.execution.DefaultBuildExecuter.execute(DefaultBuildExecuter.java:37)
         at org.gradle.execution.DefaultBuildExecuter.access$000(DefaultBuildExecuter.java:23)
         at org.gradle.execution.DefaultBuildExecuter$1.proceed(DefaultBuildExecuter.java:43)
         at org.gradle.execution.DryRunBuildExecutionAction.execute(DryRunBuildExecutionAction.java:32)
         at org.gradle.execution.DefaultBuildExecuter.execute(DefaultBuildExecuter.java:37)
         at org.gradle.execution.DefaultBuildExecuter.execute(DefaultBuildExecuter.java:30)
         at org.gradle.initialization.DefaultGradleLauncher$3.execute(DefaultGradleLauncher.java:196)
         at org.gradle.initialization.DefaultGradleLauncher$3.execute(DefaultGradleLauncher.java:193)
         at org.gradle.internal.Transformers$4.transform(Transformers.java:169)
         at org.gradle.internal.progress.DefaultBuildOperationExecutor.run(DefaultBuildOperationExecutor.java:106)
         at org.gradle.internal.progress.DefaultBuildOperationExecutor.run(DefaultBuildOperationExecutor.java:56)
         at org.gradle.initialization.DefaultGradleLauncher.doBuildStages(DefaultGradleLauncher.java:193)
         at org.gradle.initialization.DefaultGradleLauncher.doBuild(DefaultGradleLauncher.java:119)
         at org.gradle.initialization.DefaultGradleLauncher.run(DefaultGradleLauncher.java:102)
         at org.gradle.launcher.exec.GradleBuildController.run(GradleBuildController.java:71)
         at org.gradle.tooling.internal.provider.ExecuteBuildActionRunner.run(ExecuteBuildActionRunner.java:28)
         at org.gradle.launcher.exec.ChainingBuildActionRunner.run(ChainingBuildActionRunner.java:35)
         at org.gradle.launcher.exec.InProcessBuildActionExecuter.execute(InProcessBuildActionExecuter.java:41)
         at org.gradle.launcher.exec.InProcessBuildActionExecuter.execute(InProcessBuildActionExecuter.java:26)
         at org.gradle.tooling.internal.provider.ContinuousBuildActionExecuter.execute(ContinuousBuildActionExecuter.java:75)
         at org.gradle.tooling.internal.provider.ContinuousBuildActionExecuter.execute(ContinuousBuildActionExecuter.java:49)
         at org.gradle.tooling.internal.provider.ServicesSetupBuildActionExecuter.execute(ServicesSetupBuildActionExecuter.java:44)
         at org.gradle.tooling.internal.provider.ServicesSetupBuildActionExecuter.execute(ServicesSetupBuildActionExecuter.java:29)
         at org.gradle.launcher.cli.RunBuildAction.run(RunBuildAction.java:51)
         at org.gradle.internal.Actions$RunnableActionAdapter.execute(Actions.java:173)
         at org.gradle.launcher.cli.CommandLineActionFactory$ParseAndBuildAction.execute(CommandLineActionFactory.java:244)
         at org.gradle.launcher.cli.CommandLineActionFactory$ParseAndBuildAction.execute(CommandLineActionFactory.java:217)
         at org.gradle.launcher.cli.JavaRuntimeValidationAction.execute(JavaRuntimeValidationAction.java:33)
         at org.gradle.launcher.cli.JavaRuntimeValidationAction.execute(JavaRuntimeValidationAction.java:24)
         at org.gradle.launcher.cli.ExceptionReportingAction.execute(ExceptionReportingAction.java:33)
         at org.gradle.launcher.cli.ExceptionReportingAction.execute(ExceptionReportingAction.java:22)
         at org.gradle.launcher.cli.CommandLineActionFactory$WithLogging.execute(CommandLineActionFactory.java:210)
         at org.gradle.launcher.cli.CommandLineActionFactory$WithLogging.execute(CommandLineActionFactory.java:174)
         at org.gradle.launcher.Main.doAction(Main.java:33)
         at org.gradle.launcher.bootstrap.EntryPoint.run(EntryPoint.java:45)
         at org.gradle.launcher.bootstrap.ProcessBootstrap.runNoExit(ProcessBootstrap.java:60)
         at org.gradle.launcher.bootstrap.ProcessBootstrap.run(ProcessBootstrap.java:37)
         at org.gradle.launcher.GradleMain.main(GradleMain.java:23)
         at org.gradle.wrapper.BootstrapMainStarter.start(BootstrapMainStarter.java:31)
         at org.gradle.wrapper.WrapperExecutor.execute(WrapperExecutor.java:108)
         at org.gradle.wrapper.GradleWrapperMain.main(GradleWrapperMain.java:61)
      Caused by: org.gradle.api.UncheckedIOException: java.io.IOException: Process '[cmd, /c, ""C:\opt\dev\projects\github\liferay-portal-7.0.x-private\modules\apps\frontend-theme-1975-london\frontend-theme-1975-london\build_gradle\node\node" "C:/opt/dev/projects/github/liferay-portal-7.0.x-private/modules/apps/frontend-theme-1975-london/frontend-theme-1975-london/build_gradle/node/node_modules/npm/bin/npm-cli.js" "--loglevel" "warn" "--progress" "true" "--registry" "http://mirrors.lax.liferay.com:4873" "install""]' finished with non-zero exit value 1
         at org.gradle.internal.UncheckedException.throwAsUncheckedException(UncheckedException.java:43)
         at org.gradle.internal.reflect.JavaMethod.invoke(JavaMethod.java:76)
         at org.gradle.api.internal.project.taskfactory.DefaultTaskClassInfoStore$StandardTaskAction.doExecute(DefaultTaskClassInfoStore.java:141)
         at org.gradle.api.internal.project.taskfactory.DefaultTaskClassInfoStore$StandardTaskAction.execute(DefaultTaskClassInfoStore.java:134)
         at org.gradle.api.internal.project.taskfactory.DefaultTaskClassInfoStore$StandardTaskAction.execute(DefaultTaskClassInfoStore.java:123)
         at org.gradle.api.internal.AbstractTask$TaskActionWrapper.execute(AbstractTask.java:632)
         at org.gradle.api.internal.AbstractTask$TaskActionWrapper.execute(AbstractTask.java:615)
         at org.gradle.api.internal.tasks.execution.ExecuteActionsTaskExecuter.executeAction(ExecuteActionsTaskExecuter.java:95)
         at org.gradle.api.internal.tasks.execution.ExecuteActionsTaskExecuter.executeActions(ExecuteActionsTaskExecuter.java:76)
         ... 62 more
      Caused by: java.io.IOException: Process '[cmd, /c, ""C:\opt\dev\projects\github\liferay-portal-7.0.x-private\modules\apps\frontend-theme-1975-london\frontend-theme-1975-london\build_gradle\node\node" "C:/opt/dev/projects/github/liferay-portal-7.0.x-private/modules/apps/frontend-theme-1975-london/frontend-theme-1975-london/build_gradle/node/node_modules/npm/bin/npm-cli.js" "--loglevel" "warn" "--progress" "true" "--registry" "http://mirrors.lax.liferay.com:4873" "install""]' finished with non-zero exit value 1
         at com.liferay.gradle.plugins.node.internal.NodeExecutor._executeProcessBuilder(NodeExecutor.java:165)
         at com.liferay.gradle.plugins.node.internal.NodeExecutor.execute(NodeExecutor.java:72)
         at com.liferay.gradle.plugins.node.tasks.ExecuteNodeTask.executeNode(ExecuteNodeTask.java:64)
         at com.liferay.gradle.plugins.node.tasks.ExecuteNodeScriptTask.executeNode(ExecuteNodeScriptTask.java:40)
         at com.liferay.gradle.plugins.node.tasks.ExecuteNpmTask.executeNode(ExecuteNpmTask.java:108)
         at com.liferay.gradle.plugins.node.tasks.NpmInstallTask._npmInstall(NpmInstallTask.java:465)
         at com.liferay.gradle.plugins.node.tasks.NpmInstallTask._npmInstallCached(NpmInstallTask.java:361)
         at com.liferay.gradle.plugins.node.tasks.NpmInstallTask.executeNpmInstall(NpmInstallTask.java:191)
         at com.liferay.gradle.plugins.node.tasks.NpmInstallTask.executeNode(NpmInstallTask.java:99)
         at org.gradle.internal.reflect.JavaMethod.invoke(JavaMethod.java:73)
         ... 69 more
      
      ==============================================================================
      
      2: Task failed with an exception.
      -----------
      * What went wrong:
      Execution failed for task ':apps:frontend-theme-fjord:frontend-theme-fjord:npmInstall'.
      > java.io.IOException: Process '[cmd, /c, ""C:\opt\dev\projects\github\liferay-portal-7.0.x-private\modules\apps\frontend-theme-fjord\frontend-theme-fjord\build_gradle\node\node" "C:/opt/dev/projects/github/liferay-portal-7.0.x-private/modules/apps/frontend-theme-fjord/frontend-theme-fjord/build_gradle/node/node_modules/npm/bin/npm-cli.js" "--loglevel" "warn" "--progress" "true" "--registry" "http://mirrors.lax.liferay.com:4873" "install""]' finished with non-zero exit value 1
      
      * Try:
      Run with --info or --debug option to get more log output.
      
      * Exception is:
      org.gradle.api.tasks.TaskExecutionException: Execution failed for task ':apps:frontend-theme-fjord:frontend-theme-fjord:npmInstall'.
         at org.gradle.api.internal.tasks.execution.ExecuteActionsTaskExecuter.executeActions(ExecuteActionsTaskExecuter.java:84)
         at org.gradle.api.internal.tasks.execution.ExecuteActionsTaskExecuter.execute(ExecuteActionsTaskExecuter.java:55)
         at org.gradle.api.internal.tasks.execution.SkipUpToDateTaskExecuter.execute(SkipUpToDateTaskExecuter.java:62)
         at org.gradle.api.internal.tasks.execution.ValidatingTaskExecuter.execute(ValidatingTaskExecuter.java:58)
         at org.gradle.api.internal.tasks.execution.SkipEmptySourceFilesTaskExecuter.execute(SkipEmptySourceFilesTaskExecuter.java:88)
         at org.gradle.api.internal.tasks.execution.ResolveTaskArtifactStateTaskExecuter.execute(ResolveTaskArtifactStateTaskExecuter.java:46)
         at org.gradle.api.internal.tasks.execution.SkipTaskWithNoActionsExecuter.execute(SkipTaskWithNoActionsExecuter.java:51)
         at org.gradle.api.internal.tasks.execution.SkipOnlyIfTaskExecuter.execute(SkipOnlyIfTaskExecuter.java:54)
         at org.gradle.api.internal.tasks.execution.ExecuteAtMostOnceTaskExecuter.execute(ExecuteAtMostOnceTaskExecuter.java:43)
         at org.gradle.api.internal.tasks.execution.CatchExceptionTaskExecuter.execute(CatchExceptionTaskExecuter.java:34)
         at org.gradle.execution.taskgraph.DefaultTaskGraphExecuter$EventFiringTaskWorker$1.execute(DefaultTaskGraphExecuter.java:236)
         at org.gradle.execution.taskgraph.DefaultTaskGraphExecuter$EventFiringTaskWorker$1.execute(DefaultTaskGraphExecuter.java:228)
         at org.gradle.internal.Transformers$4.transform(Transformers.java:169)
         at org.gradle.internal.progress.DefaultBuildOperationExecutor.run(DefaultBuildOperationExecutor.java:106)
         at org.gradle.internal.progress.DefaultBuildOperationExecutor.run(DefaultBuildOperationExecutor.java:61)
         at org.gradle.execution.taskgraph.DefaultTaskGraphExecuter$EventFiringTaskWorker.execute(DefaultTaskGraphExecuter.java:228)
         at org.gradle.execution.taskgraph.DefaultTaskGraphExecuter$EventFiringTaskWorker.execute(DefaultTaskGraphExecuter.java:215)
         at org.gradle.execution.taskgraph.AbstractTaskPlanExecutor$TaskExecutorWorker.processTask(AbstractTaskPlanExecutor.java:77)
         at org.gradle.execution.taskgraph.AbstractTaskPlanExecutor$TaskExecutorWorker.run(AbstractTaskPlanExecutor.java:58)
         at org.gradle.internal.concurrent.ExecutorPolicy$CatchAndRecordFailures.onExecute(ExecutorPolicy.java:54)
         at org.gradle.internal.concurrent.StoppableExecutorImpl$1.run(StoppableExecutorImpl.java:40)
         at java.util.concurrent.ThreadPoolExecutor.runWorker(ThreadPoolExecutor.java:1142)
         at java.util.concurrent.ThreadPoolExecutor$Worker.run(ThreadPoolExecutor.java:617)
         at java.lang.Thread.run(Thread.java:745)
      Caused by: org.gradle.api.UncheckedIOException: java.io.IOException: Process '[cmd, /c, ""C:\opt\dev\projects\github\liferay-portal-7.0.x-private\modules\apps\frontend-theme-fjord\frontend-theme-fjord\build_gradle\node\node" "C:/opt/dev/projects/github/liferay-portal-7.0.x-private/modules/apps/frontend-theme-fjord/frontend-theme-fjord/build_gradle/node/node_modules/npm/bin/npm-cli.js" "--loglevel" "warn" "--progress" "true" "--registry" "http://mirrors.lax.liferay.com:4873" "install""]' finished with non-zero exit value 1
         at org.gradle.internal.UncheckedException.throwAsUncheckedException(UncheckedException.java:43)
         at org.gradle.internal.reflect.JavaMethod.invoke(JavaMethod.java:76)
         at org.gradle.api.internal.project.taskfactory.DefaultTaskClassInfoStore$StandardTaskAction.doExecute(DefaultTaskClassInfoStore.java:141)
         at org.gradle.api.internal.project.taskfactory.DefaultTaskClassInfoStore$StandardTaskAction.execute(DefaultTaskClassInfoStore.java:134)
         at org.gradle.api.internal.project.taskfactory.DefaultTaskClassInfoStore$StandardTaskAction.execute(DefaultTaskClassInfoStore.java:123)
         at org.gradle.api.internal.AbstractTask$TaskActionWrapper.execute(AbstractTask.java:632)
         at org.gradle.api.internal.AbstractTask$TaskActionWrapper.execute(AbstractTask.java:615)
         at org.gradle.api.internal.tasks.execution.ExecuteActionsTaskExecuter.executeAction(ExecuteActionsTaskExecuter.java:95)
         at org.gradle.api.internal.tasks.execution.ExecuteActionsTaskExecuter.executeActions(ExecuteActionsTaskExecuter.java:76)
         ... 23 more
      Caused by: java.io.IOException: Process '[cmd, /c, ""C:\opt\dev\projects\github\liferay-portal-7.0.x-private\modules\apps\frontend-theme-fjord\frontend-theme-fjord\build_gradle\node\node" "C:/opt/dev/projects/github/liferay-portal-7.0.x-private/modules/apps/frontend-theme-fjord/frontend-theme-fjord/build_gradle/node/node_modules/npm/bin/npm-cli.js" "--loglevel" "warn" "--progress" "true" "--registry" "http://mirrors.lax.liferay.com:4873" "install""]' finished with non-zero exit value 1
         at com.liferay.gradle.plugins.node.internal.NodeExecutor._executeProcessBuilder(NodeExecutor.java:165)
         at com.liferay.gradle.plugins.node.internal.NodeExecutor.execute(NodeExecutor.java:72)
         at com.liferay.gradle.plugins.node.tasks.ExecuteNodeTask.executeNode(ExecuteNodeTask.java:64)
         at com.liferay.gradle.plugins.node.tasks.ExecuteNodeScriptTask.executeNode(ExecuteNodeScriptTask.java:40)
         at com.liferay.gradle.plugins.node.tasks.ExecuteNpmTask.executeNode(ExecuteNpmTask.java:108)
         at com.liferay.gradle.plugins.node.tasks.NpmInstallTask._npmInstall(NpmInstallTask.java:465)
         at com.liferay.gradle.plugins.node.tasks.NpmInstallTask._npmInstallCached(NpmInstallTask.java:361)
         at com.liferay.gradle.plugins.node.tasks.NpmInstallTask.executeNpmInstall(NpmInstallTask.java:191)
         at com.liferay.gradle.plugins.node.tasks.NpmInstallTask.executeNode(NpmInstallTask.java:99)
         at sun.reflect.NativeMethodAccessorImpl.invoke0(Native Method)
         at sun.reflect.NativeMethodAccessorImpl.invoke(NativeMethodAccessorImpl.java:62)
         at sun.reflect.DelegatingMethodAccessorImpl.invoke(DelegatingMethodAccessorImpl.java:43)
         at java.lang.reflect.Method.invoke(Method.java:497)
         at org.gradle.internal.reflect.JavaMethod.invoke(JavaMethod.java:73)
         ... 30 more
      
      ==============================================================================
      
      BUILD FAILED
      
      Total time: 28 mins 28.475 secs
      Gradle build finished at 2018-03-30 20:56:15.099.
      
      The following error occurred while executing this line:
      C:\opt\dev\projects\github\liferay-portal-7.0.x-private\build-dist.xml:604: The following error occurred while executing this line:
      C:\opt\dev\projects\github\liferay-portal-7.0.x-private\build.xml:397: The following error occurred while executing this line:
      C:\opt\dev\projects\github\liferay-portal-7.0.x-private\build-common.xml:796: C:\opt\dev\projects\github\liferay-portal-7.0.x-private\build-common.xml:798: exec returned: 1
      Deleting: C:\opt\dev\projects\github\liferay-portal-7.0.x-private\null1608018815.properties
      

      Reproduced on:
      Tomcat 8.0.32 + MySQL 5.7
      Portal 7.0.x-private GIT ID: 555b3536ec9ba6e65c2e24d28b5acbc923e2cf18

        Attachments

          Activity

            People

            Assignee:
            anthony.chu Anthony Chu
            Reporter:
            anthony.chu Anthony Chu
            Participants of an Issue:
            Recent user:
            Michael Saechang
            Votes:
            0 Vote for this issue
            Watchers:
            0 Start watching this issue

              Dates

              Created:
              Updated:
              Resolved:
              Days since last comment:
              2 years, 39 weeks, 5 days ago

                Packages

                Version Package
                Master