Uploaded image for project: 'PUBLIC - Liferay Portal Community Edition'
  1. PUBLIC - Liferay Portal Community Edition
  2. LPS-84917

SF reverts artifact version in build.gradle and warns about variable names that has more than 2 uppercase letters

    Details

    • Type: Bug
    • Status: Open
    • Resolution: Unresolved
    • Affects Version/s: 7.0.X
    • Fix Version/s: None
    • Labels:
      None

      Description

      Hi bugs from ticket summary prevent our build server to reach integration test phase. Please fix this, we are sick of source formatter bugs.

      Here is log from build server:

      travis_fold:start:step_start_instance
      [0K[33;1mStarting instance[0m
      âœ" selected image "travis-ci-garnet-trusty-1512502259-986baf0"
      âœ" rendered startup script
      âœ" inserted instance
      • sleeping 5s before checking instance insert
      • polling for instance insert completion...
      âœ" instance is ready (6.526s)
      travis_fold:end:step_start_instance
      [0Ktravis_fold:start:step_upload_script
      [0K[33;1mUploading script[0m
      • waiting for ssh connectivity.......
      âœ" ssh connectivity established (24.311s)
      âœ" uploaded script
      travis_fold:end:step_upload_script
      [0Ktravis_fold:start:worker_info
      [0K[33;1mWorker information[0m
      hostname: 5ea65454-45f7-4c92-9ffc-3f6adaa024f4@1.production-1-worker-com-a-5-gce
      version: v4.0.1 https://github.com/travis-ci/worker/tree/ca93e0d83dad3533f1048a5e9eb65b37cf92fa59
      instance: travis-job-43a2d826-1e5d-481c-926b-88a0f3f34a19 travis-ci-garnet-trusty-1512502259-986baf0 (via amqp)
      startup: 6.526619897s
      travis_fold:end:worker_info
      [0Ktravis_fold:start:system_info
      [0K[33;1mBuild system information[0m
      Build language: java
      Build group: stable
      Build dist: trusty
      Build id: 83262576
      Job id: 142718553
      Runtime kernel version: 4.4.0-101-generic
      travis-build version: 769664d90
      [34m[1mBuild image provisioning date and time[0m
      Tue Dec  5 19:58:13 UTC 2017
      [34m[1mOperating System Details[0m
      Distributor ID:	Ubuntu
      Description:	Ubuntu 14.04.5 LTS
      Release:	14.04
      Codename:	trusty
      [34m[1mCookbooks Version[0m
      7c2c6a6 https://github.com/travis-ci/travis-cookbooks/tree/7c2c6a6
      [34m[1mgit version[0m
      git version 2.15.1
      [34m[1mbash version[0m
      GNU bash, version 4.3.11(1)-release (x86_64-pc-linux-gnu)
      [34m[1mgcc version[0m
      gcc (Ubuntu 4.8.4-2ubuntu1~14.04.3) 4.8.4
      Copyright (C) 2013 Free Software Foundation, Inc.
      This is free software; see the source for copying conditions.  There is NO
      warranty; not even for MERCHANTABILITY or FITNESS FOR A PARTICULAR PURPOSE.
      
      [34m[1mdocker version[0m
      Client:
       Version:      17.09.0-ce
       API version:  1.32
       Go version:   go1.8.3
       Git commit:   afdb6d4
       Built:        Tue Sep 26 22:42:38 2017
       OS/Arch:      linux/amd64
      
      Server:
       Version:      17.09.0-ce
       API version:  1.32 (minimum version 1.12)
       Go version:   go1.8.3
       Git commit:   afdb6d4
       Built:        Tue Sep 26 22:41:20 2017
       OS/Arch:      linux/amd64
       Experimental: false
      [34m[1mclang version[0m
      clang version 5.0.0 (tags/RELEASE_500/final)
      Target: x86_64-unknown-linux-gnu
      Thread model: posix
      InstalledDir: /usr/local/clang-5.0.0/bin
      [34m[1mjq version[0m
      jq-1.5
      [34m[1mbats version[0m
      Bats 0.4.0
      [34m[1mshellcheck version[0m
      0.4.6
      [34m[1mshfmt version[0m
      v2.0.0
      [34m[1mccache version[0m
      ccache version 3.1.9
      
      Copyright (C) 2002-2007 Andrew Tridgell
      Copyright (C) 2009-2011 Joel Rosdahl
      
      This program is free software; you can redistribute it and/or modify it under
      the terms of the GNU General Public License as published by the Free Software
      Foundation; either version 3 of the License, or (at your option) any later
      version.
      [34m[1mcmake version[0m
      cmake version 3.9.2
      
      CMake suite maintained and supported by Kitware (kitware.com/cmake).
      [34m[1mheroku version[0m
      heroku-cli/6.14.39-addc925 (linux-x64) node-v9.2.0
      [34m[1mimagemagick version[0m
      Version: ImageMagick 6.7.7-10 2017-07-31 Q16 http://www.imagemagick.org
      [34m[1mmd5deep version[0m
      4.2
      [34m[1mmercurial version[0m
      Mercurial Distributed SCM (version 4.2.2)
      (see https://mercurial-scm.org for more information)
      
      Copyright (C) 2005-2017 Matt Mackall and others
      This is free software; see the source for copying conditions. There is NO
      warranty; not even for MERCHANTABILITY or FITNESS FOR A PARTICULAR PURPOSE.
      [34m[1mmysql version[0m
      mysql  Ver 14.14 Distrib 5.6.33, for debian-linux-gnu (x86_64) using  EditLine wrapper
      [34m[1mopenssl version[0m
      OpenSSL 1.0.1f 6 Jan 2014
      [34m[1mpacker version[0m
      Packer v1.0.2
      
      Your version of Packer is out of date! The latest version
      is 1.1.2. You can update by downloading from www.packer.io
      [34m[1mpostgresql client version[0m
      psql (PostgreSQL) 9.6.6
      [34m[1mragel version[0m
      Ragel State Machine Compiler version 6.8 Feb 2013
      Copyright (c) 2001-2009 by Adrian Thurston
      [34m[1msubversion version[0m
      svn, version 1.8.8 (r1568071)
         compiled Aug 10 2017, 17:20:39 on x86_64-pc-linux-gnu
      
      Copyright (C) 2013 The Apache Software Foundation.
      This software consists of contributions made by many people;
      see the NOTICE file for more information.
      Subversion is open source software, see http://subversion.apache.org/
      
      The following repository access (RA) modules are available:
      
      * ra_svn : Module for accessing a repository using the svn network protocol.
        - with Cyrus SASL authentication
        - handles 'svn' scheme
      * ra_local : Module for accessing a repository on local disk.
        - handles 'file' scheme
      * ra_serf : Module for accessing a repository via WebDAV protocol using serf.
        - using serf 1.3.3
        - handles 'http' scheme
        - handles 'https' scheme
      
      [34m[1msudo version[0m
      Sudo version 1.8.9p5
      Configure options: --prefix=/usr -v --with-all-insults --with-pam --with-fqdn --with-logging=syslog --with-logfac=authpriv --with-env-editor --with-editor=/usr/bin/editor --with-timeout=15 --with-password-timeout=0 --with-passprompt=[sudo] password for %p:  --without-lecture --with-tty-tickets --disable-root-mailer --enable-admin-flag --with-sendmail=/usr/sbin/sendmail --with-timedir=/var/lib/sudo --mandir=/usr/share/man --libexecdir=/usr/lib/sudo --with-sssd --with-sssd-lib=/usr/lib/x86_64-linux-gnu --with-selinux
      Sudoers policy plugin version 1.8.9p5
      Sudoers file grammar version 43
      
      Sudoers path: /etc/sudoers
      Authentication methods: 'pam'
      Syslog facility if syslog is being used for logging: authpriv
      Syslog priority to use when user authenticates successfully: notice
      Syslog priority to use when user authenticates unsuccessfully: alert
      Send mail if the user is not in sudoers
      Use a separate timestamp for each user/tty combo
      Lecture user the first time they run sudo
      Root may run sudo
      Allow some information gathering to give useful error messages
      Require fully-qualified hostnames in the sudoers file
      Visudo will honor the EDITOR environment variable
      Set the LOGNAME and USER environment variables
      Length at which to wrap log file lines (0 for no wrap): 80
      Authentication timestamp timeout: 15.0 minutes
      Password prompt timeout: 0.0 minutes
      Number of tries to enter a password: 3
      Umask to use or 0777 to use user's: 022
      Path to mail program: /usr/sbin/sendmail
      Flags for mail program: -t
      Address to send mail to: root
      Subject line for mail messages: *** SECURITY information for %h ***
      Incorrect password message: Sorry, try again.
      Path to authentication timestamp dir: /var/lib/sudo
      Default password prompt: [sudo] password for %p: 
      Default user to run commands as: root
      Value to override user's $PATH with: /usr/local/sbin:/usr/local/bin:/usr/sbin:/usr/bin:/sbin:/bin:/snap/bin
      Path to the editor for use by visudo: /usr/bin/editor
      When to require a password for 'list' pseudocommand: any
      When to require a password for 'verify' pseudocommand: all
      File descriptors >= 3 will be closed before executing a command
      Environment variables to check for sanity:
      	TZ
      	TERM
      	LINGUAS
      	LC_*
      	LANGUAGE
      	LANG
      	COLORTERM
      Environment variables to remove:
      	RUBYOPT
      	RUBYLIB
      	PYTHONUSERBASE
      	PYTHONINSPECT
      	PYTHONPATH
      	PYTHONHOME
      	TMPPREFIX
      	ZDOTDIR
      	READNULLCMD
      	NULLCMD
      	FPATH
      	PERL5DB
      	PERL5OPT
      	PERL5LIB
      	PERLLIB
      	PERLIO_DEBUG 
      	JAVA_TOOL_OPTIONS
      	SHELLOPTS
      	GLOBIGNORE
      	PS4
      	BASH_ENV
      	ENV
      	TERMCAP
      	TERMPATH
      	TERMINFO_DIRS
      	TERMINFO
      	_RLD*
      	LD_*
      	PATH_LOCALE
      	NLSPATH
      	HOSTALIASES
      	RES_OPTIONS
      	LOCALDOMAIN
      	CDPATH
      	IFS
      Environment variables to preserve:
      	JAVA_HOME
      	TRAVIS
      	CI
      	DEBIAN_FRONTEND
      	XAUTHORIZATION
      	XAUTHORITY
      	PS2
      	PS1
      	PATH
      	LS_COLORS
      	KRB5CCNAME
      	HOSTNAME
      	HOME
      	DISPLAY
      	COLORS
      Locale to use while parsing sudoers: C
      Directory in which to store input/output logs: /var/log/sudo-io
      File in which to store the input/output log: %{seq}
      Add an entry to the utmp/utmpx file when allocating a pty
      PAM service name to use
      PAM service name to use for login shells
      Create a new PAM session for the command to run in
      Maximum I/O log sequence number: 0
      
      Local IP address and netmask pairs:
      	10.240.0.28/255.255.255.255
      	172.17.0.1/255.255.0.0
      
      Sudoers I/O plugin version 1.8.9p5
      [34m[1mgzip version[0m
      gzip 1.6
      Copyright (C) 2007, 2010, 2011 Free Software Foundation, Inc.
      Copyright (C) 1993 Jean-loup Gailly.
      This is free software.  You may redistribute copies of it under the terms of
      the GNU General Public License <http://www.gnu.org/licenses/gpl.html>.
      There is NO WARRANTY, to the extent permitted by law.
      
      Written by Jean-loup Gailly.
      [34m[1mzip version[0m
      Copyright (c) 1990-2008 Info-ZIP - Type 'zip "-L"' for software license.
      This is Zip 3.0 (July 5th 2008), by Info-ZIP.
      Currently maintained by E. Gordon.  Please send bug reports to
      the authors using the web page at www.info-zip.org; see README for details.
      
      Latest sources and executables are at ftp://ftp.info-zip.org/pub/infozip,
      as of above date; see http://www.info-zip.org/ for other sites.
      
      Compiled with gcc 4.8.2 for Unix (Linux ELF) on Oct 21 2013.
      
      Zip special compilation options:
      	USE_EF_UT_TIME       (store Universal Time)
      	BZIP2_SUPPORT        (bzip2 library version 1.0.6, 6-Sept-2010)
      	    bzip2 code and library copyright (c) Julian R Seward
      	    (See the bzip2 license for terms of use)
      	SYMLINK_SUPPORT      (symbolic links supported)
      	LARGE_FILE_SUPPORT   (can read and write large files on file system)
      	ZIP64_SUPPORT        (use Zip64 to store large files in archives)
      	UNICODE_SUPPORT      (store and read UTF-8 Unicode paths)
      	STORE_UNIX_UIDs_GIDs (store UID/GID sizes/values using new extra field)
      	UIDGID_NOT_16BIT     (old Unix 16-bit UID/GID extra field not used)
      	[encryption, version 2.91 of 05 Jan 2007] (modified for Zip 3)
      
      Encryption notice:
      	The encryption code of this program is not copyrighted and is
      	put in the public domain.  It was originally written in Europe
      	and, to the best of our knowledge, can be freely distributed
      	in both source and object forms from any country, including
      	the USA under License Exception TSU of the U.S. Export
      	Administration Regulations (section 740.13(e)) of 6 June 2002.
      
      Zip environment options:
                   ZIP:  [none]
                ZIPOPT:  [none]
      [34m[1mvim version[0m
      VIM - Vi IMproved 7.4 (2013 Aug 10, compiled Nov 24 2016 16:43:18)
      Included patches: 1-52
      Extra patches: 8.0.0056
      Modified by pkg-vim-maintainers@lists.alioth.debian.org
      Compiled by buildd@
      Huge version without GUI.  Features included (+) or not (-):
      +acl             +farsi           +mouse_netterm   +syntax
      +arabic          +file_in_path    +mouse_sgr       +tag_binary
      +autocmd         +find_in_path    -mouse_sysmouse  +tag_old_static
      -balloon_eval    +float           +mouse_urxvt     -tag_any_white
      -browse          +folding         +mouse_xterm     -tcl
      ++builtin_terms  -footer          +multi_byte      +terminfo
      +byte_offset     +fork()          +multi_lang      +termresponse
      +cindent         +gettext         -mzscheme        +textobjects
      -clientserver    -hangul_input    +netbeans_intg   +title
      -clipboard       +iconv           +path_extra      -toolbar
      +cmdline_compl   +insert_expand   -perl            +user_commands
      +cmdline_hist    +jumplist        +persistent_undo +vertsplit
      +cmdline_info    +keymap          +postscript      +virtualedit
      +comments        +langmap         +printer         +visual
      +conceal         +libcall         +profile         +visualextra
      +cryptv          +linebreak       +python          +viminfo
      +cscope          +lispindent      -python3         +vreplace
      +cursorbind      +listcmds        +quickfix        +wildignore
      +cursorshape     +localmap        +reltime         +wildmenu
      +dialog_con      -lua             +rightleft       +windows
      +diff            +menu            -ruby            +writebackup
      +digraphs        +mksession       +scrollbind      -X11
      -dnd             +modify_fname    +signs           -xfontset
      -ebcdic          +mouse           +smartindent     -xim
      +emacs_tags      -mouseshape      -sniff           -xsmp
      +eval            +mouse_dec       +startuptime     -xterm_clipboard
      +ex_extra        +mouse_gpm       +statusline      -xterm_save
      +extra_search    -mouse_jsbterm   -sun_workshop    -xpm
         system vimrc file: "$VIM/vimrc"
           user vimrc file: "$HOME/.vimrc"
       2nd user vimrc file: "~/.vim/vimrc"
            user exrc file: "$HOME/.exrc"
        fall-back for $VIM: "/usr/share/vim"
      Compilation: gcc -c -I. -Iproto -DHAVE_CONFIG_H     -g -O2 -fstack-protector --param=ssp-buffer-size=4 -Wformat -Werror=format-security -U_FORTIFY_SOURCE -D_FORTIFY_SOURCE=1      
      Linking: gcc   -Wl,-Bsymbolic-functions -Wl,-z,relro -Wl,--as-needed -o vim        -lm -ltinfo -lnsl  -lselinux  -lacl -lattr -lgpm -ldl    -L/usr/lib/python2.7/config-x86_64-linux-gnu -lpython2.7 -lpthread -ldl -lutil -lm -Xlinker -export-dynamic -Wl,-O1 -Wl,-Bsymbolic-functions      
      [34m[1miptables version[0m
      iptables v1.4.21
      [34m[1mcurl version[0m
      curl 7.35.0 (x86_64-pc-linux-gnu) libcurl/7.35.0 OpenSSL/1.0.1f zlib/1.2.8 libidn/1.28 librtmp/2.3
      [34m[1mwget version[0m
      GNU Wget 1.15 built on linux-gnu.
      [34m[1mrsync version[0m
      rsync  version 3.1.0  protocol version 31
      [34m[1mgimme version[0m
      v1.2.0
      [34m[1mnvm version[0m
      0.33.6
      [34m[1mperlbrew version[0m
      /home/travis/perl5/perlbrew/bin/perlbrew  - App::perlbrew/0.80
      [34m[1mphpenv version[0m
      rbenv 1.1.1-25-g6aa70b6
      [34m[1mrvm version[0m
      rvm 1.29.3 (latest) by Michal Papis, Piotr Kuczynski, Wayne E. Seguin [https://rvm.io]
      [34m[1mdefault ruby version[0m
      ruby 2.4.1p111 (2017-03-22 revision 58053) [x86_64-linux]
      [34m[1mCouchDB version[0m
      couchdb 1.6.1
      [34m[1mElasticSearch version[0m
      5.5.0
      [34m[1mInstalled Firefox version[0m
      firefox 56.0.2
      [34m[1mMongoDB version[0m
      MongoDB 3.4.10
      [34m[1mPhantomJS version[0m
      2.1.1
      [34m[1mPre-installed PostgreSQL versions[0m
      9.2.24
      9.3.20
      9.4.15
      9.5.10
      9.6.6
      [34m[1mRabbitMQ Version[0m
      3.6.14
      [34m[1mRedis version[0m
      redis-server 4.0.6
      [34m[1mriak version[0m
      2.2.3
      [34m[1mPre-installed Go versions[0m
      1.7.4
      [34m[1mant version[0m
      Apache Ant(TM) version 1.9.3 compiled on April 8 2014
      [34m[1mmvn version[0m
      Apache Maven 3.5.2 (138edd61fd100ec658bfa2d307c43b76940a5d7d; 2017-10-18T07:58:13Z)
      Maven home: /usr/local/maven-3.5.2
      Java version: 1.8.0_151, vendor: Oracle Corporation
      Java home: /usr/lib/jvm/java-8-oracle/jre
      Default locale: en_US, platform encoding: UTF-8
      OS name: "linux", version: "4.4.0-98-generic", arch: "amd64", family: "unix"
      [34m[1mgradle version[0m
      
      ------------------------------------------------------------
      Gradle 4.0.1
      ------------------------------------------------------------
      
      Build time:   2017-07-07 14:02:41 UTC
      Revision:     38e5dc0f772daecca1d2681885d3d85414eb6826
      
      Groovy:       2.4.11
      Ant:          Apache Ant(TM) version 1.9.6 compiled on June 29 2015
      JVM:          1.8.0_151 (Oracle Corporation 25.151-b12)
      OS:           Linux 4.4.0-98-generic amd64
      
      [34m[1mlein version[0m
      Leiningen 2.8.1 on Java 1.8.0_151 Java HotSpot(TM) 64-Bit Server VM
      [34m[1mPre-installed Node.js versions[0m
      v4.8.6
      v6.12.0
      v6.12.1
      v8.9
      v8.9.1
      [34m[1mphpenv versions[0m
        system
        5.6
      * 5.6.32 (set by /home/travis/.phpenv/version)
        7.0
        7.0.25
        7.1
        7.1.11
        hhvm
        hhvm-stable
      [34m[1mcomposer --version[0m
      Composer version 1.5.2 2017-09-11 16:59:25
      [34m[1mPre-installed Ruby versions[0m
      ruby-2.2.7
      ruby-2.3.4
      ruby-2.4.1
      travis_fold:end:system_info
      [0K
      [32;1mNetwork availability confirmed.[0m
      
      $ jdk_switcher use oraclejdk8
      Switching to Oracle JDK8 (java-8-oracle), JAVA_HOME will be set to /usr/lib/jvm/java-8-oracle
      travis_fold:start:services
      [0Ktravis_time:start:0dff5acc
      [0K$ sudo service docker start
      start: Job is already running: docker
      
      travis_time:end:0dff5acc:start=1535564511748708669,finish=1535564511765808376,duration=17099707
      [0Ktravis_fold:end:services
      [0Ktravis_fold:start:ssh_key
      [0KInstalling SSH key from: default repository key
      Key fingerprint: 1c:ab:c5:25:f5:83:fb:d3:c9:5d:e8:8e:49:f3:0b:f8
      travis_fold:end:ssh_key
      [0Ktravis_fold:start:git.netrc
      [0K[33;1mUsing /home/travis/.netrc to clone repository.[0m
      
      travis_fold:end:git.netrc
      [0K
      travis_fold:start:git.checkout
      [0Ktravis_time:start:322d44a4
      [0K$ git clone --depth=50 --branch=7.0.x-private https://github.com/liferay/com-liferay-osb-lcs-private.git liferay/com-liferay-osb-lcs-private
      Cloning into 'liferay/com-liferay-osb-lcs-private'...
      
      travis_time:end:322d44a4:start=1535564514796330693,finish=1535564518644800676,duration=3848469983
      [0K$ cd liferay/com-liferay-osb-lcs-private
      $ git checkout -qf 36f70239b0ae73b77407c7e361d4fef71697640c
      travis_fold:end:git.checkout
      [0K
      [33;1mSetting environment variables from repository settings[0m
      $ export GRADLE_OPTS=[secure]
      $ export COVERALLS_REPO_TOKEN=[secure]
      $ export DOCKER_USER=[secure]
      $ export DOCKER_PWD=[secure]
      $ export SONATYPE_SNAPSHOT_USERNAME=[secure]
      $ export SONATYPE_SNAPSHOT_PASSWORD=[secure]
      $ export AWS_ACCESS_KEY_ID=[secure]
      $ export AWS_SECRET_ACCESS_KEY=[secure]
      $ export AWS_REGION=[secure]
      
      $ export TERM=dumb
      [33;1mDisabling Gradle daemon[0m
      $ mkdir -p ~/.gradle && echo "org.gradle.daemon=false" >> ~/.gradle/gradle.properties
      travis_fold:start:cache.1
      [0KSetting up build cache
      $ export CASHER_DIR=$HOME/.casher
      travis_time:start:05ea2880
      [0K$ Installing caching utilities
      
      travis_time:end:05ea2880:start=1535564523841552966,finish=1535564524080707313,duration=239154347
      [0Ktravis_time:start:0a104a35
      [0K
      travis_time:end:0a104a35:start=1535564524088608833,finish=1535564524093568759,duration=4959926
      [0Ktravis_time:start:29c4a063
      [0K[32;1mattempting to download cache archive[0m
      [32;1mfetching 7.0.x-private/cache-linux-trusty-e3b0c44298fc1c149afbf4c8996fb92427ae41e4649b934ca495991b7852b855--jdk-oraclejdk8.tgz[0m
      [32;1mfound cache[0m
      
      travis_time:end:29c4a063:start=1535564524100452287,finish=1535564556949665803,duration=32849213516
      [0Ktravis_time:start:007b2276
      [0K
      travis_time:end:007b2276:start=1535564556955352513,finish=1535564556961108306,duration=5755793
      [0Ktravis_time:start:2938e98a
      [0K[32;1madding /home/travis/.gradle/caches to cache[0m
      [32;1mcreating directory /home/travis/.gradle/caches[0m
      [32;1madding /home/travis/.gradle/wrapper to cache[0m
      [32;1mcreating directory /home/travis/.gradle/wrapper[0m
      [32;1madding /home/travis/build/liferay/com-liferay-osb-lcs-private/com-liferay-osb-lcs-private/node_modules to cache[0m
      [32;1mcreating directory /home/travis/build/liferay/com-liferay-osb-lcs-private/com-liferay-osb-lcs-private/node_modules[0m
      
      travis_time:end:2938e98a:start=1535564556967455572,finish=1535564673951719937,duration=116984264365
      [0Ktravis_fold:end:cache.1
      [0K$ java -Xmx32m -version
      java version "1.8.0_151"
      Java(TM) SE Runtime Environment (build 1.8.0_151-b12)
      Java HotSpot(TM) 64-Bit Server VM (build 25.151-b12, mixed mode)
      $ javac -J-Xmx32m -version
      javac 1.8.0_151
      travis_fold:start:before_install.1
      [0Ktravis_time:start:0767c527
      [0K$ if [ "$TRAVIS_EVENT_TYPE" = "push" ] && [ "$TRAVIS_BRANCH" != "7.0.x-private" ]; then echo "Terminating build since there is also a pull request build running."; travis_terminate 0; fi
      
      travis_time:end:0767c527:start=1535564677619071237,finish=1535564677624148123,duration=5076886
      [0Ktravis_fold:end:before_install.1
      [0Ktravis_fold:start:before_install.2
      [0Ktravis_time:start:0074ae62
      [0K$ curl -O https://liferay-labs.github.io/reports-catcher/catch-reports.sh
      
      travis_time:end:0074ae62:start=1535564677630554062,finish=1535564677840094063,duration=209540001
      [0Ktravis_fold:end:before_install.2
      [0Ktravis_fold:start:before_install.3
      [0Ktravis_time:start:0285daef
      [0K$ chmod +x catch-reports.sh
      
      travis_time:end:0285daef:start=1535564677848932234,finish=1535564677855591603,duration=6659369
      [0Ktravis_fold:end:before_install.3
      [0Ktravis_fold:start:install
      [0Ktravis_time:start:1b010562
      [0K$ true
      
      travis_time:end:1b010562:start=1535564677864309028,finish=1535564677870239035,duration=5930007
      [0Ktravis_fold:end:install
      [0Ktravis_fold:start:before_script.1
      [0Ktravis_time:start:097274df
      [0K$ ./gradlew checkSourceFormatting findbugsMain findbugsTest findbugsTestIntegration pmdMain pmdTest pmdTestIntegration
      Download https://repository-cdn.liferay.com/nexus/content/groups/public/com/liferay/com.liferay.gradle.plugins.defaults/5.5.25/com.liferay.gradle.plugins.defaults-5.5.25.pom
      Download https://repository-cdn.liferay.com/nexus/content/groups/public/com/liferay/com.liferay.gradle.plugins/3.12.117/com.liferay.gradle.plugins-3.12.117.pom
      Download https://repository-cdn.liferay.com/nexus/content/groups/public/com/liferay/com.liferay.gradle.plugins.baseline/1.3.2/com.liferay.gradle.plugins.baseline-1.3.2.pom
      Download https://repository-cdn.liferay.com/nexus/content/groups/public/com/liferay/com.liferay.ant.bnd/2.0.54/com.liferay.ant.bnd-2.0.54.pom
      Download https://repository-cdn.liferay.com/nexus/content/groups/public/com/liferay/com.liferay.gradle.plugins.css.builder/2.2.3/com.liferay.gradle.plugins.css.builder-2.2.3.pom
      Download https://repository-cdn.liferay.com/nexus/content/groups/public/com/liferay/com.liferay.gradle.plugins.service.builder/2.1.55/com.liferay.gradle.plugins.service.builder-2.1.55.pom
      Download https://repository-cdn.liferay.com/nexus/content/groups/public/com/liferay/com.liferay.gradle.plugins.source.formatter/2.3.241/com.liferay.gradle.plugins.source.formatter-2.3.241.pom
      Download https://repository-cdn.liferay.com/nexus/content/groups/public/com/liferay/com.liferay.gradle.plugins.test.integration/2.3.1/com.liferay.gradle.plugins.test.integration-2.3.1.pom
      Download https://repository-cdn.liferay.com/nexus/content/groups/public/com/liferay/com.liferay.gradle.util/1.0.30/com.liferay.gradle.util-1.0.30.pom
      Download https://repository-cdn.liferay.com/nexus/content/groups/public/com/liferay/com.liferay.gradle.plugins.defaults/5.5.25/com.liferay.gradle.plugins.defaults-5.5.25.jar
      Download https://repository-cdn.liferay.com/nexus/content/groups/public/com/liferay/com.liferay.gradle.plugins/3.12.117/com.liferay.gradle.plugins-3.12.117.jar
      Download https://repository-cdn.liferay.com/nexus/content/groups/public/com/liferay/com.liferay.gradle.plugins.baseline/1.3.2/com.liferay.gradle.plugins.baseline-1.3.2.jar
      Download https://repository-cdn.liferay.com/nexus/content/groups/public/com/liferay/com.liferay.ant.bnd/2.0.54/com.liferay.ant.bnd-2.0.54.jar
      Download https://repository-cdn.liferay.com/nexus/content/groups/public/com/liferay/com.liferay.gradle.plugins.css.builder/2.2.3/com.liferay.gradle.plugins.css.builder-2.2.3.jar
      Download https://repository-cdn.liferay.com/nexus/content/groups/public/com/liferay/com.liferay.gradle.plugins.service.builder/2.1.55/com.liferay.gradle.plugins.service.builder-2.1.55.jar
      Download https://repository-cdn.liferay.com/nexus/content/groups/public/com/liferay/com.liferay.gradle.plugins.source.formatter/2.3.241/com.liferay.gradle.plugins.source.formatter-2.3.241.jar
      Download https://repository-cdn.liferay.com/nexus/content/groups/public/com/liferay/com.liferay.gradle.plugins.test.integration/2.3.1/com.liferay.gradle.plugins.test.integration-2.3.1.jar
      Download https://repository-cdn.liferay.com/nexus/content/groups/public/com/liferay/com.liferay.gradle.util/1.0.30/com.liferay.gradle.util-1.0.30.jar
      Download https://repository-cdn.liferay.com/nexus/content/groups/public/com/liferay/com.liferay.gradle.plugins.source.formatter/2.3.242/com.liferay.gradle.plugins.source.formatter-2.3.242.pom
      Download https://repository-cdn.liferay.com/nexus/content/groups/public/com/liferay/com.liferay.gradle.plugins.source.formatter/2.3.242/com.liferay.gradle.plugins.source.formatter-2.3.242.jar
      Unable to configure styled parent theme
      Unable to configure unstyled parent theme
      Unable to configure styled parent theme
      Unable to configure unstyled parent theme
      :checkSourceFormatting
      Download https://repository-cdn.liferay.com/nexus/content/groups/public/com/liferay/com.liferay.source.formatter/1.0.715/com.liferay.source.formatter-1.0.715.pom
      Download https://repository-cdn.liferay.com/nexus/content/groups/public/com/liferay/com.liferay.source.formatter/1.0.715/com.liferay.source.formatter-1.0.715.jar
      /home/travis/build/liferay/com-liferay-osb-lcs-private/osb-lcs-rest-client/build.gradle (SourceCheck:GradleDependencyVersionCheck)
      /home/travis/build/liferay/com-liferay-osb-lcs-private/osb-lcs-spring-core/build.gradle (SourceCheck:GradleDependencyVersionCheck)
      /home/travis/build/liferay/com-liferay-osb-lcs-private/osb-lcs-scheduler-web/build.gradle (SourceCheck:GradleDependencyVersionCheck)
      /home/travis/build/liferay/com-liferay-osb-lcs-private/osb-lcs-messaging-spring-echo-sample1-web/build.gradle (SourceCheck:GradleDependencyVersionCheck)
      /home/travis/build/liferay/com-liferay-osb-lcs-private/osb-lcs-metrics-processor-web/build.gradle (SourceCheck:GradleDependencyVersionCheck)
      /home/travis/build/liferay/com-liferay-osb-lcs-private/osb-lcs-service/build.gradle (SourceCheck:GradleDependencyVersionCheck)
      /home/travis/build/liferay/com-liferay-osb-lcs-private/osb-lcs-heartbeat-processor-web/build.gradle (SourceCheck:GradleDependencyVersionCheck)
      /home/travis/build/liferay/com-liferay-osb-lcs-private/osb-lcs-queue-gateway-web/build.gradle (SourceCheck:GradleDependencyVersionCheck)
      /home/travis/build/liferay/com-liferay-osb-lcs-private/osb-lcs-messaging-processor-web/build.gradle (SourceCheck:GradleDependencyVersionCheck)
      /home/travis/build/liferay/com-liferay-osb-lcs-private/build-ext.gradle (SourceCheck:GradleDependencyVersionCheck)
      Rename method 'getNonHeapUsage' to 'getNonheapUsage': ./osb-lcs-nosql-api/src/main/java/com/liferay/osb/lcs/nosql/model/LCSClusterNodeJVMMetrics.java 49 (Checkstyle:MethodNamingCheck)
      Rename method 'setNonHeapUsage' to 'setNonheapUsage': ./osb-lcs-nosql-api/src/main/java/com/liferay/osb/lcs/nosql/model/LCSClusterNodeJVMMetrics.java 93 (Checkstyle:MethodNamingCheck)
      Rename method 'getNonHeapUsage' to 'getNonheapUsage': ./osb-lcs-nosql-service/src/main/java/com/liferay/osb/lcs/nosql/model/impl/LCSClusterNodeJVMMetricsEventsImpl.java 102 (Checkstyle:MethodNamingCheck)
      Rename method 'setNonHeapUsage' to 'setNonheapUsage': ./osb-lcs-nosql-service/src/main/java/com/liferay/osb/lcs/nosql/model/impl/LCSClusterNodeJVMMetricsEventsImpl.java 242 (Checkstyle:MethodNamingCheck)
      Rename method 'getNonHeapUsage' to 'getNonheapUsage': ./osb-lcs-nosql-service/src/main/java/com/liferay/osb/lcs/nosql/model/impl/LCSClusterNodeJVMMetricsImpl.java 101 (Checkstyle:MethodNamingCheck)
      Rename method 'setNonHeapUsage' to 'setNonheapUsage': ./osb-lcs-nosql-service/src/main/java/com/liferay/osb/lcs/nosql/model/impl/LCSClusterNodeJVMMetricsImpl.java 236 (Checkstyle:MethodNamingCheck)
      Rename method 'isNonSecurePortEnabled' to 'isNonsecurePortEnabled': ./osb-lcs-registry-activator/src/main/java/com/liferay/osb/lcs/registry/activator/configuration/eureka/appinfo/EurekaInstanceConfiguration.java 61 (Checkstyle:MethodNamingCheck)
      Rename method 'nonSecurePort' to 'nonsecurePort': ./osb-lcs-registry-activator/src/main/java/com/liferay/osb/lcs/registry/activator/configuration/eureka/appinfo/EurekaInstanceConfiguration.java 76 (Checkstyle:MethodNamingCheck)
      Rename method 'getNonSecurePort' to 'getNonsecurePort': ./osb-lcs-registry-activator/src/main/java/com/liferay/osb/lcs/registry/activator/configuration/eureka/appinfo/OSGiEurekaInstanceConfig.java 152 (Checkstyle:MethodNamingCheck)
      Rename method 'isNonSecurePortEnabled' to 'isNonsecurePortEnabled': ./osb-lcs-registry-activator/src/main/java/com/liferay/osb/lcs/registry/activator/configuration/eureka/appinfo/OSGiEurekaInstanceConfig.java 245 (Checkstyle:MethodNamingCheck)
      Rename method '_doPostLCSClusterNode' to '_postLCSClusterNode': ./osb-lcs-test/src/testIntegration/java/com/liferay/osb/lcs/rest/test/LCSClusterNodeResourceTest.java 706 (Checkstyle:MethodNamingCheck)
      Exception in thread "main" java.lang.Exception: Found 21 formatting issues:
      1: Rename method 'getNonHeapUsage' to 'getNonheapUsage': ./osb-lcs-nosql-api/src/main/java/com/liferay/osb/lcs/nosql/model/LCSClusterNodeJVMMetrics.java 49 (Checkstyle:MethodNamingCheck)
      2: Rename method 'setNonHeapUsage' to 'setNonheapUsage': ./osb-lcs-nosql-api/src/main/java/com/liferay/osb/lcs/nosql/model/LCSClusterNodeJVMMetrics.java 93 (Checkstyle:MethodNamingCheck)
      3: Rename method 'getNonHeapUsage' to 'getNonheapUsage': ./osb-lcs-nosql-service/src/main/java/com/liferay/osb/lcs/nosql/model/impl/LCSClusterNodeJVMMetricsEventsImpl.java 102 (Checkstyle:MethodNamingCheck)
      4: Rename method 'setNonHeapUsage' to 'setNonheapUsage': ./osb-lcs-nosql-service/src/main/java/com/liferay/osb/lcs/nosql/model/impl/LCSClusterNodeJVMMetricsEventsImpl.java 242 (Checkstyle:MethodNamingCheck)
      5: Rename method 'getNonHeapUsage' to 'getNonheapUsage': ./osb-lcs-nosql-service/src/main/java/com/liferay/osb/lcs/nosql/model/impl/LCSClusterNodeJVMMetricsImpl.java 101 (Checkstyle:MethodNamingCheck)
      6: Rename method 'setNonHeapUsage' to 'setNonheapUsage': ./osb-lcs-nosql-service/src/main/java/com/liferay/osb/lcs/nosql/model/impl/LCSClusterNodeJVMMetricsImpl.java 236 (Checkstyle:MethodNamingCheck)
      7: Rename method 'isNonSecurePortEnabled' to 'isNonsecurePortEnabled': ./osb-lcs-registry-activator/src/main/java/com/liferay/osb/lcs/registry/activator/configuration/eureka/appinfo/EurekaInstanceConfiguration.java 61 (Checkstyle:MethodNamingCheck)
      8: Rename method 'nonSecurePort' to 'nonsecurePort': ./osb-lcs-registry-activator/src/main/java/com/liferay/osb/lcs/registry/activator/configuration/eureka/appinfo/EurekaInstanceConfiguration.java 76 (Checkstyle:MethodNamingCheck)
      9: Rename method 'getNonSecurePort' to 'getNonsecurePort': ./osb-lcs-registry-activator/src/main/java/com/liferay/osb/lcs/registry/activator/configuration/eureka/appinfo/OSGiEurekaInstanceConfig.java 152 (Checkstyle:MethodNamingCheck)
      10: Rename method 'isNonSecurePortEnabled' to 'isNonsecurePortEnabled': ./osb-lcs-registry-activator/src/main/java/com/liferay/osb/lcs/registry/activator/configuration/eureka/appinfo/OSGiEurekaInstanceConfig.java 245 (Checkstyle:MethodNamingCheck)
      11: Rename method '_doPostLCSClusterNode' to '_postLCSClusterNode': ./osb-lcs-test/src/testIntegration/java/com/liferay/osb/lcs/rest/test/LCSClusterNodeResourceTest.java 706 (Checkstyle:MethodNamingCheck)
      12: ./osb-lcs-rest-client/build.gradle expected:<....client", version: "[7.0].0"
      	compileOnly gro...> but was:<....client", version: "[8.1].0"
      	compileOnly gro...>
      13: ./osb-lcs-spring-core/build.gradle expected:<....client", version: "[7.0].0"
      	compileOnly gro...> but was:<....client", version: "[8.1].0"
      	compileOnly gro...>
      14: ./osb-lcs-scheduler-web/build.gradle expected:<....client", version: "[7.0].0"
      	compile group: ...> but was:<....client", version: "[8.1].0"
      	compile group: ...>
      15: ./osb-lcs-messaging-spring-echo-sample1-web/build.gradle expected:<....client", version: "[7.0].0"
      	compile group: ...> but was:<....client", version: "[8.1].0"
      	compile group: ...>
      16: ./osb-lcs-metrics-processor-web/build.gradle expected:<....client", version: "[7.0].0"
      	compile group: ...> but was:<....client", version: "[8.1].0"
      	compile group: ...>
      17: ./osb-lcs-service/build.gradle expected:<....client", version: "[7.0].0"
      	compileOnly gro...> but was:<....client", version: "[8.1].0"
      	compileOnly gro...>
      18: ./osb-lcs-heartbeat-processor-web/build.gradle expected:<....client", version: "[7.0].0"
      	compile group: ...> but was:<....client", version: "[8.1].0"
      	compile group: ...>
      19: ./osb-lcs-queue-gateway-web/build.gradle expected:<....client", version: "[7.0].0"
      	compile group: ...> but was:<....client", version: "[8.1].0"
      	compile group: ...>
      20: ./osb-lcs-messaging-processor-web/build.gradle expected:<....client", version: "[7.0].0"
      	compile group: ...> but was:<....client", version: "[8.1].0"
      	compile group: ...>
      21: ./build-ext.gradle expected:<....client", version: "[7.0].0"
      	osblcs group: "...> but was:<....client", version: "[8.1].0"
      	osblcs group: "...>
      
      	at com.liferay.source.formatter.SourceFormatter.format(SourceFormatter.java:395)
      	at com.liferay.source.formatter.SourceFormatter.main(SourceFormatter.java:234)
      :checkSourceFormatting FAILED
      
      FAILURE: Build failed with an exception.
      
      * What went wrong:
      Execution failed for task ':checkSourceFormatting'.
      > Process 'command '/usr/lib/jvm/java-8-oracle/bin/java'' finished with non-zero exit value 1
      
      * Try:
      Run with --stacktrace option to get the stack trace. Run with --info or --debug option to get more log output.
      
      BUILD FAILED
      
      Total time: 1 mins 23.093 secs
      
      travis_time:end:097274df:start=1535564677878518185,finish=1535564761141456202,duration=83262938017
      [0K
      [31;1mThe command "./gradlew checkSourceFormatting findbugsMain findbugsTest findbugsTestIntegration pmdMain pmdTest pmdTestIntegration" failed and exited with 1 during .[0m
      
      Your build has been stopped.
      

        Attachments

          Activity

            People

            • Assignee:
              support-lep@liferay.com SE Support
              Reporter:
              igor.beslic Igor Beslic
              Participants of an Issue:
              Recent user:
              Igor Beslic
            • Votes:
              0 Vote for this issue
              Watchers:
              0 Start watching this issue

              Dates

              • Created:
                Updated:
                Days since last comment:
                38 weeks, 2 days ago