Details

      Description

      P:/project/lfee70xp/portal/modules (17:19:32) [7.0.x-private]
      > gw :private:apps:lcs:lcs-portlet:updateVersion '--stacktrace'
      P:\project\lfee70xp\portal\gradlew :private:apps:lcs:lcs-portlet:updateVersion --stacktrace
      Configuration on demand is an incubating feature.
      > Task :private:apps:lcs:lcs-portlet:updateVersion FAILED
      
      FAILURE: Build failed with an exception.
      
      * What went wrong:
      Execution failed for task ':private:apps:lcs:lcs-portlet:updateVersion'.
      > null
      
      * Try:
      Run with --info or --debug option to get more log output. Run with --scan to get full insights.
      
      * Exception is:
      org.gradle.api.tasks.TaskExecutionException: Execution failed for task ':private:apps:lcs:lcs-portlet:updateVersion'.
              at org.gradle.api.internal.tasks.execution.ValidatingTaskExecuter.execute(ValidatingTaskExecuter.java:49)
              at org.gradle.api.internal.tasks.execution.SkipEmptySourceFilesTaskExecuter.execute(SkipEmptySourceFilesTaskExecuter.java:101)
              at org.gradle.api.internal.tasks.execution.FinalizeInputFilePropertiesTaskExecuter.execute(FinalizeInputFilePropertiesTaskExecuter.java:44)
              at org.gradle.api.internal.tasks.execution.CleanupStaleOutputsExecuter.execute(CleanupStaleOutputsExecuter.java:91)
              at org.gradle.api.internal.tasks.execution.ResolveTaskArtifactStateTaskExecuter.execute(ResolveTaskArtifactStateTaskExecuter.java:62)
              at org.gradle.api.internal.tasks.execution.SkipTaskWithNoActionsExecuter.execute(SkipTaskWithNoActionsExecuter.java:59)
              at org.gradle.api.internal.tasks.execution.SkipOnlyIfTaskExecuter.execute(SkipOnlyIfTaskExecuter.java:54)
              at org.gradle.api.internal.tasks.execution.ExecuteAtMostOnceTaskExecuter.execute(ExecuteAtMostOnceTaskExecuter.java:43)
              at org.gradle.api.internal.tasks.execution.CatchExceptionTaskExecuter.execute(CatchExceptionTaskExecuter.java:34)
              at org.gradle.api.internal.tasks.execution.EventFiringTaskExecuter$1.run(EventFiringTaskExecuter.java:51)
              at org.gradle.internal.operations.DefaultBuildOperationExecutor$RunnableBuildOperationWorker.execute(DefaultBuildOperationExecutor.java:300)
              at org.gradle.internal.operations.DefaultBuildOperationExecutor$RunnableBuildOperationWorker.execute(DefaultBuildOperationExecutor.java:292)
              at org.gradle.internal.operations.DefaultBuildOperationExecutor.execute(DefaultBuildOperationExecutor.java:174)
              at org.gradle.internal.operations.DefaultBuildOperationExecutor.run(DefaultBuildOperationExecutor.java:90)
              at org.gradle.internal.operations.DelegatingBuildOperationExecutor.run(DelegatingBuildOperationExecutor.java:31)
              at org.gradle.api.internal.tasks.execution.EventFiringTaskExecuter.execute(EventFiringTaskExecuter.java:46)
              at org.gradle.execution.taskgraph.LocalTaskInfoExecutor.execute(LocalTaskInfoExecutor.java:42)
              at org.gradle.execution.taskgraph.DefaultTaskExecutionGraph$BuildOperationAwareWorkItemExecutor.execute(DefaultTaskExecutionGraph.java:277)
              at org.gradle.execution.taskgraph.DefaultTaskExecutionGraph$BuildOperationAwareWorkItemExecutor.execute(DefaultTaskExecutionGraph.java:262)
              at org.gradle.execution.taskgraph.DefaultTaskPlanExecutor$ExecutorWorker$1.execute(DefaultTaskPlanExecutor.java:135)
              at org.gradle.execution.taskgraph.DefaultTaskPlanExecutor$ExecutorWorker$1.execute(DefaultTaskPlanExecutor.java:130)
              at org.gradle.execution.taskgraph.DefaultTaskPlanExecutor$ExecutorWorker.execute(DefaultTaskPlanExecutor.java:200)
              at org.gradle.execution.taskgraph.DefaultTaskPlanExecutor$ExecutorWorker.executeWithWork(DefaultTaskPlanExecutor.java:191)
              at org.gradle.execution.taskgraph.DefaultTaskPlanExecutor$ExecutorWorker.run(DefaultTaskPlanExecutor.java:130)
              at org.gradle.internal.concurrent.ExecutorPolicy$CatchAndRecordFailures.onExecute(ExecutorPolicy.java:63)
              at org.gradle.internal.concurrent.ManagedExecutorImpl$1.run(ManagedExecutorImpl.java:46)
              at org.gradle.internal.concurrent.ThreadFactoryImpl$ManagedThreadRunnable.run(ThreadFactoryImpl.java:55)
      Caused by: java.lang.NumberFormatException: null
              at com.liferay.gradle.plugins.defaults.LiferayAntDefaultsPlugin$3.doCall(LiferayAntDefaultsPlugin.java:176)
              at org.gradle.util.GUtil.uncheckedCall(GUtil.java:459)
              at org.gradle.util.DeferredUtil.unpack(DeferredUtil.java:37)
              at org.gradle.api.internal.tasks.properties.bean.AbstractNestedRuntimeBeanNode$DefaultPropertyValue.validate(AbstractNestedRuntimeBeanNode.java:149)
              at org.gradle.api.internal.tasks.DefaultTaskInputPropertySpec.validate(DefaultTaskInputPropertySpec.java:61)
              at org.gradle.api.internal.tasks.execution.DefaultTaskProperties.validate(DefaultTaskProperties.java:193)
              at org.gradle.api.internal.tasks.execution.ValidatingTaskExecuter.execute(ValidatingTaskExecuter.java:47)
              ... 26 more
      
      
      * Get more help at https://help.gradle.org
      
      BUILD FAILED in 7s
      1 actionable task: 1 executed
      

        Attachments

          Activity

            People

            • Assignee:
              brian.chan Brian Chan
              Reporter:
              peter.shin Peter Shin
              Recent user:
              Enterprise Release HU
              Participants of an Issue:
            • Votes:
              0 Vote for this issue
              Watchers:
              0 Start watching this issue

              Dates

              • Created:
                Updated:
                Resolved: