Details

    • Fix Priority:
      5

      Description

      Steps to reproduce:

      1. Update to latest 7.1.x.
      2. Try to build the bundle.

      Actual Result:
      BUILD FAILED.

           [exec] FAILURE: Build failed with an exception.
           [exec] 
           [exec] * What went wrong:
           [exec] Could not resolve all files for configuration ':apps:asset:asset-publisher-web:compileClasspath'.
           [exec] > Could not find com.liferay:com.liferay.subscription.api:2.0.0.
           [exec]   Searched in the following locations:
           [exec]     - file:/opt/dev/projects/github/liferay-portal-7.1.x-private/.m2/com/liferay/com.liferay.subscription.api/2.0.0/com.liferay.subscription.api-2.0.0.pom
           [exec]     - file:/opt/dev/projects/github/liferay-portal-7.1.x-private/.m2/com/liferay/com.liferay.subscription.api/2.0.0/com.liferay.subscription.api-2.0.0.jar
           [exec]     - http://repository-cdn.liferay.com/nexus/content/groups/public/com/liferay/com.liferay.subscription.api/2.0.0/com.liferay.subscription.api-2.0.0.pom
           [exec]     - http://repository-cdn.liferay.com/nexus/content/groups/public/com/liferay/com.liferay.subscription.api/2.0.0/com.liferay.subscription.api-2.0.0.jar
           [exec]     - http://repository-cdn.liferay.com/nexus/service/local/repo_groups/private/content/com/liferay/com.liferay.subscription.api/2.0.0/com.liferay.subscription.api-2.0.0.pom
           [exec]     - http://repository-cdn.liferay.com/nexus/service/local/repo_groups/private/content/com/liferay/com.liferay.subscription.api/2.0.0/com.liferay.subscription.api-2.0.0.jar
           [exec]   Required by:
           [exec]       project :apps:asset:asset-publisher-web
           [exec] 
           [exec] * Try:
           [exec] Run with --info or --debug option to get more log output. Run with --scan to get full insights.
           [exec] 
           [exec] * Exception is:
           [exec] org.gradle.api.internal.artifacts.ivyservice.DefaultLenientConfiguration$ArtifactResolveException: Could not resolve all files for configuration ':apps:asset:asset-publisher-web:compileClasspath'.
           [exec] 	at org.gradle.api.internal.artifacts.configurations.DefaultConfiguration.rethrowFailure(DefaultConfiguration.java:1054)
           [exec] 	at org.gradle.api.internal.artifacts.configurations.DefaultConfiguration.access$1700(DefaultConfiguration.java:123)
           [exec] 	at org.gradle.api.internal.artifacts.configurations.DefaultConfiguration$ConfigurationFileCollection.getFiles(DefaultConfiguration.java:1028)
           [exec] 	at org.gradle.api.internal.file.AbstractFileCollection.iterator(AbstractFileCollection.java:76)
           [exec] 	at org.gradle.api.internal.artifacts.configurations.DefaultConfiguration.iterator(DefaultConfiguration.java:439)
           [exec] 	at org.gradle.api.internal.changedetection.state.DefaultFileSystemSnapshotter$FileCollectionVisitorImpl.visitCollection(DefaultFileSystemSnapshotter.java:257)
           [exec] 	at org.gradle.api.internal.file.AbstractFileCollection.visitRootElements(AbstractFileCollection.java:282)
           [exec] 	at org.gradle.api.internal.file.CompositeFileCollection.visitRootElements(CompositeFileCollection.java:206)
           [exec] 	at org.gradle.api.internal.changedetection.state.DefaultFileSystemSnapshotter.snapshot(DefaultFileSystemSnapshotter.java:142)
           [exec] 	at org.gradle.internal.fingerprint.impl.AbstractFileCollectionFingerprinter.fingerprint(AbstractFileCollectionFingerprinter.java:54)
           [exec] 	at org.gradle.internal.fingerprint.impl.DefaultCompileClasspathFingerprinter.fingerprint(DefaultCompileClasspathFingerprinter.java:46)
           [exec] 	at org.gradle.api.internal.changedetection.state.CacheBackedTaskHistoryRepository.fingerprintTaskFiles(CacheBackedTaskHistoryRepository.java:358)
           [exec] 	at org.gradle.api.internal.changedetection.state.CacheBackedTaskHistoryRepository.createExecution(CacheBackedTaskHistoryRepository.java:163)
           [exec] 	at org.gradle.api.internal.changedetection.state.CacheBackedTaskHistoryRepository.access$100(CacheBackedTaskHistoryRepository.java:76)
           [exec] 	at org.gradle.api.internal.changedetection.state.CacheBackedTaskHistoryRepository$1.getCurrentExecution(CacheBackedTaskHistoryRepository.java:123)
           [exec] 	at org.gradle.api.internal.changedetection.changes.DefaultTaskArtifactStateRepository$TaskArtifactStateImpl.getStates(DefaultTaskArtifactStateRepository.java:200)
           [exec] 	at org.gradle.api.internal.changedetection.changes.DefaultTaskArtifactStateRepository$TaskArtifactStateImpl.isUpToDate(DefaultTaskArtifactStateRepository.java:94)
           [exec] 	at org.gradle.api.internal.tasks.execution.SkipUpToDateTaskExecuter.execute(SkipUpToDateTaskExecuter.java:50)
           [exec] 	at org.gradle.api.internal.tasks.execution.ResolveTaskOutputCachingStateExecuter.execute(ResolveTaskOutputCachingStateExecuter.java:54)
           [exec] 	at org.gradle.api.internal.tasks.execution.ValidatingTaskExecuter.execute(ValidatingTaskExecuter.java:59)
           [exec] 	at org.gradle.api.internal.tasks.execution.SkipEmptySourceFilesTaskExecuter.execute(SkipEmptySourceFilesTaskExecuter.java:101)
           [exec] 	at org.gradle.api.internal.tasks.execution.FinalizeInputFilePropertiesTaskExecuter.execute(FinalizeInputFilePropertiesTaskExecuter.java:44)
           [exec] 	at org.gradle.api.internal.tasks.execution.CleanupStaleOutputsExecuter.execute(CleanupStaleOutputsExecuter.java:91)
           [exec] 	at org.gradle.api.internal.tasks.execution.ResolveTaskArtifactStateTaskExecuter.execute(ResolveTaskArtifactStateTaskExecuter.java:62)
           [exec] 	at org.gradle.api.internal.tasks.execution.SkipTaskWithNoActionsExecuter.execute(SkipTaskWithNoActionsExecuter.java:59)
           [exec] 	at org.gradle.api.internal.tasks.execution.SkipOnlyIfTaskExecuter.execute(SkipOnlyIfTaskExecuter.java:54)
           [exec] 	at org.gradle.api.internal.tasks.execution.ExecuteAtMostOnceTaskExecuter.execute(ExecuteAtMostOnceTaskExecuter.java:43)
           [exec] 	at org.gradle.api.internal.tasks.execution.CatchExceptionTaskExecuter.execute(CatchExceptionTaskExecuter.java:34)
           [exec] 	at org.gradle.api.internal.tasks.execution.EventFiringTaskExecuter$1.run(EventFiringTaskExecuter.java:51)
           [exec] 	at org.gradle.internal.operations.DefaultBuildOperationExecutor$RunnableBuildOperationWorker.execute(DefaultBuildOperationExecutor.java:300)
           [exec] 	at org.gradle.internal.operations.DefaultBuildOperationExecutor$RunnableBuildOperationWorker.execute(DefaultBuildOperationExecutor.java:292)
           [exec] 	at org.gradle.internal.operations.DefaultBuildOperationExecutor.execute(DefaultBuildOperationExecutor.java:174)
           [exec] 	at org.gradle.internal.operations.DefaultBuildOperationExecutor.run(DefaultBuildOperationExecutor.java:90)
           [exec] 	at org.gradle.internal.operations.DelegatingBuildOperationExecutor.run(DelegatingBuildOperationExecutor.java:31)
           [exec] 	at org.gradle.api.internal.tasks.execution.EventFiringTaskExecuter.execute(EventFiringTaskExecuter.java:46)
           [exec] 	at org.gradle.execution.taskgraph.LocalTaskInfoExecutor.execute(LocalTaskInfoExecutor.java:42)
           [exec] 	at org.gradle.execution.taskgraph.DefaultTaskExecutionGraph$BuildOperationAwareWorkItemExecutor.execute(DefaultTaskExecutionGraph.java:277)
           [exec] 	at org.gradle.execution.taskgraph.DefaultTaskExecutionGraph$BuildOperationAwareWorkItemExecutor.execute(DefaultTaskExecutionGraph.java:262)
           [exec] 	at org.gradle.execution.taskgraph.DefaultTaskPlanExecutor$ExecutorWorker$1.execute(DefaultTaskPlanExecutor.java:135)
           [exec] 	at org.gradle.execution.taskgraph.DefaultTaskPlanExecutor$ExecutorWorker$1.execute(DefaultTaskPlanExecutor.java:130)
           [exec] 	at org.gradle.execution.taskgraph.DefaultTaskPlanExecutor$ExecutorWorker.execute(DefaultTaskPlanExecutor.java:200)
           [exec] 	at org.gradle.execution.taskgraph.DefaultTaskPlanExecutor$ExecutorWorker.executeWithWork(DefaultTaskPlanExecutor.java:191)
           [exec] 	at org.gradle.execution.taskgraph.DefaultTaskPlanExecutor$ExecutorWorker.run(DefaultTaskPlanExecutor.java:130)
           [exec] 	at org.gradle.internal.concurrent.ExecutorPolicy$CatchAndRecordFailures.onExecute(ExecutorPolicy.java:63)
           [exec] 	at org.gradle.internal.concurrent.ManagedExecutorImpl$1.run(ManagedExecutorImpl.java:46)
           [exec] 	at org.gradle.internal.concurrent.ThreadFactoryImpl$ManagedThreadRunnable.run(ThreadFactoryImpl.java:55)
           [exec] Caused by: org.gradle.internal.resolve.ModuleVersionNotFoundException: Could not find com.liferay:com.liferay.subscription.api:2.0.0.
           [exec] Searched in the following locations:
           [exec]   - file:/opt/dev/projects/github/liferay-portal-7.1.x-private/.m2/com/liferay/com.liferay.subscription.api/2.0.0/com.liferay.subscription.api-2.0.0.pom
           [exec]   - file:/opt/dev/projects/github/liferay-portal-7.1.x-private/.m2/com/liferay/com.liferay.subscription.api/2.0.0/com.liferay.subscription.api-2.0.0.jar
           [exec]   - http://repository-cdn.liferay.com/nexus/content/groups/public/com/liferay/com.liferay.subscription.api/2.0.0/com.liferay.subscription.api-2.0.0.pom
           [exec]   - http://repository-cdn.liferay.com/nexus/content/groups/public/com/liferay/com.liferay.subscription.api/2.0.0/com.liferay.subscription.api-2.0.0.jar
           [exec]   - http://repository-cdn.liferay.com/nexus/service/local/repo_groups/private/content/com/liferay/com.liferay.subscription.api/2.0.0/com.liferay.subscription.api-2.0.0.pom
           [exec]   - http://repository-cdn.liferay.com/nexus/service/local/repo_groups/private/content/com/liferay/com.liferay.subscription.api/2.0.0/com.liferay.subscription.api-2.0.0.jar
           [exec] Required by:
           [exec]     project :apps:asset:asset-publisher-web
           [exec] 	at org.gradle.internal.resolve.result.DefaultBuildableComponentResolveResult.notFound(DefaultBuildableComponentResolveResult.java:49)
           [exec] 	at org.gradle.api.internal.artifacts.ivyservice.ivyresolve.RepositoryChainComponentMetaDataResolver.resolveModule(RepositoryChainComponentMetaDataResolver.java:108)
           [exec] 	at org.gradle.api.internal.artifacts.ivyservice.ivyresolve.RepositoryChainComponentMetaDataResolver.resolve(RepositoryChainComponentMetaDataResolver.java:63)
           [exec] 	at org.gradle.api.internal.artifacts.ivyservice.resolveengine.ComponentResolversChain$ComponentMetaDataResolverChain.resolve(ComponentResolversChain.java:94)
           [exec] 	at org.gradle.api.internal.artifacts.ivyservice.clientmodule.ClientModuleResolver.resolve(ClientModuleResolver.java:62)
           [exec] 	at org.gradle.api.internal.artifacts.ivyservice.resolveengine.graph.builder.ComponentState.resolve(ComponentState.java:208)
           [exec] 	at org.gradle.api.internal.artifacts.ivyservice.resolveengine.graph.builder.ComponentState.resolve(ComponentState.java:196)
           [exec] 	at org.gradle.api.internal.artifacts.ivyservice.resolveengine.graph.builder.ComponentState.getMetadata(ComponentState.java:152)
           [exec] 	at org.gradle.api.internal.artifacts.ivyservice.resolveengine.graph.builder.DownloadMetadataOperation.run(DownloadMetadataOperation.java:31)
           [exec] 	at org.gradle.internal.operations.DefaultBuildOperationExecutor$RunnableBuildOperationWorker.execute(DefaultBuildOperationExecutor.java:300)
           [exec] 	at org.gradle.internal.operations.DefaultBuildOperationExecutor$RunnableBuildOperationWorker.execute(DefaultBuildOperationExecutor.java:292)
           [exec] 	at org.gradle.internal.operations.DefaultBuildOperationExecutor.execute(DefaultBuildOperationExecutor.java:174)
           [exec] 	at org.gradle.internal.operations.DefaultBuildOperationExecutor.access$900(DefaultBuildOperationExecutor.java:48)
           [exec] 	at org.gradle.internal.operations.DefaultBuildOperationExecutor$ParentPreservingQueueWorker.execute(DefaultBuildOperationExecutor.java:342)
           [exec] 	at org.gradle.internal.operations.DefaultBuildOperationQueue$WorkerRunnable.runOperation(DefaultBuildOperationQueue.java:230)
           [exec] 	at org.gradle.internal.operations.DefaultBuildOperationQueue$WorkerRunnable.access$600(DefaultBuildOperationQueue.java:172)
           [exec] 	at org.gradle.internal.operations.DefaultBuildOperationQueue$WorkerRunnable$1.call(DefaultBuildOperationQueue.java:209)
           [exec] 	at org.gradle.internal.operations.DefaultBuildOperationQueue$WorkerRunnable$1.call(DefaultBuildOperationQueue.java:203)
           [exec] 	at org.gradle.internal.work.DefaultWorkerLeaseService.withLocks(DefaultWorkerLeaseService.java:154)
           [exec] 	at org.gradle.internal.operations.DefaultBuildOperationQueue$WorkerRunnable.runBatch(DefaultBuildOperationQueue.java:203)
           [exec] 	at org.gradle.internal.operations.DefaultBuildOperationQueue$WorkerRunnable.run(DefaultBuildOperationQueue.java:177)
           [exec] 	at org.gradle.internal.operations.DefaultBuildOperationQueue.waitForCompletion(DefaultBuildOperationQueue.java:116)
           [exec] 	at org.gradle.internal.operations.DefaultBuildOperationExecutor.executeInParallel(DefaultBuildOperationExecutor.java:137)
           [exec] 	at org.gradle.internal.operations.DefaultBuildOperationExecutor.runAll(DefaultBuildOperationExecutor.java:110)
           [exec] 	at org.gradle.internal.operations.DelegatingBuildOperationExecutor.runAll(DelegatingBuildOperationExecutor.java:41)
           [exec] 	at org.gradle.api.internal.artifacts.ivyservice.resolveengine.graph.builder.DependencyGraphBuilder.maybeDownloadMetadataInParallel(DependencyGraphBuilder.java:290)
           [exec] 	at org.gradle.api.internal.artifacts.ivyservice.resolveengine.graph.builder.DependencyGraphBuilder.resolveEdges(DependencyGraphBuilder.java:201)
           [exec] 	at org.gradle.api.internal.artifacts.ivyservice.resolveengine.graph.builder.DependencyGraphBuilder.traverseGraph(DependencyGraphBuilder.java:155)
           [exec] 	at org.gradle.api.internal.artifacts.ivyservice.resolveengine.graph.builder.DependencyGraphBuilder.resolve(DependencyGraphBuilder.java:126)
           [exec] 	at org.gradle.api.internal.artifacts.ivyservice.resolveengine.DefaultArtifactDependencyResolver.resolve(DefaultArtifactDependencyResolver.java:123)
           [exec] 	at org.gradle.api.internal.artifacts.ivyservice.DefaultConfigurationResolver.resolveGraph(DefaultConfigurationResolver.java:167)
           [exec] 	at org.gradle.api.internal.artifacts.ivyservice.ShortCircuitEmptyConfigurationResolver.resolveGraph(ShortCircuitEmptyConfigurationResolver.java:89)
           [exec] 	at org.gradle.api.internal.artifacts.ivyservice.ErrorHandlingConfigurationResolver.resolveGraph(ErrorHandlingConfigurationResolver.java:73)
           [exec] 	at org.gradle.api.internal.artifacts.configurations.DefaultConfiguration$5.run(DefaultConfiguration.java:533)
           [exec] 	at org.gradle.internal.operations.DefaultBuildOperationExecutor$RunnableBuildOperationWorker.execute(DefaultBuildOperationExecutor.java:300)
           [exec] 	at org.gradle.internal.operations.DefaultBuildOperationExecutor$RunnableBuildOperationWorker.execute(DefaultBuildOperationExecutor.java:292)
           [exec] 	at org.gradle.internal.operations.DefaultBuildOperationExecutor.execute(DefaultBuildOperationExecutor.java:174)
           [exec] 	at org.gradle.internal.operations.DefaultBuildOperationExecutor.run(DefaultBuildOperationExecutor.java:90)
           [exec] 	at org.gradle.internal.operations.DelegatingBuildOperationExecutor.run(DelegatingBuildOperationExecutor.java:31)
           [exec] 	at org.gradle.api.internal.artifacts.configurations.DefaultConfiguration.resolveGraphIfRequired(DefaultConfiguration.java:524)
           [exec] 	at org.gradle.api.internal.artifacts.configurations.DefaultConfiguration.resolveToStateOrLater(DefaultConfiguration.java:509)
           [exec] 	at org.gradle.api.internal.artifacts.configurations.DefaultConfiguration.access$1800(DefaultConfiguration.java:123)
           [exec] 	at org.gradle.api.internal.artifacts.configurations.DefaultConfiguration$ConfigurationFileCollection.getSelectedArtifacts(DefaultConfiguration.java:1037)
           [exec] 	at org.gradle.api.internal.artifacts.configurations.DefaultConfiguration$ConfigurationFileCollection.getFiles(DefaultConfiguration.java:1025)
           [exec] 	... 43 more
           [exec] 
           [exec] 
           [exec] * Get more help at https://help.gradle.org
           [exec] 
           [exec] BUILD FAILED in 2m 4s
      

        Attachments

          Activity

            People

            • Assignee:
              yvonne.han Yvonne Han
              Reporter:
              yvonne.han Yvonne Han
              Participants of an Issue:
              Recent user:
              Yvonne Han
            • Votes:
              0 Vote for this issue
              Watchers:
              1 Start watching this issue

              Dates

              • Created:
                Updated:
                Resolved:
                Days since last comment:
                29 weeks, 1 day ago

                Packages

                Version Package