Details

    • Fix Priority:
      5

      Description

      Steps to reproduce:

      1. Update to latest 7.1.x.
      2. Try to build the bundle.

      Actual Result:
      BUILD FAILED.

           [exec] FAILURE: Build completed with 3 failures.
           [exec] 
           [exec] 1: Task failed with an exception.
           [exec] -----------
           [exec] * What went wrong:
           [exec] Failed to capture fingerprint of output files for task ':apps:frontend-theme:frontend-theme-admin:npmInstall' property 'nodeModulesDir' during up-to-date check.
           [exec] > Could not list contents of '/opt/dev/projects/github/liferay-portal-7.1.x-private/modules/apps/frontend-theme/frontend-theme-admin/node_modules/.bin/node-gyp'. Couldn't follow symbolic link.
           [exec] 
           [exec] * Try:
           [exec] Run with --info or --debug option to get more log output. Run with --scan to get full insights.
           [exec] 
           [exec] * Exception is:
           [exec] org.gradle.api.UncheckedIOException: Failed to capture fingerprint of output files for task ':apps:frontend-theme:frontend-theme-admin:npmInstall' property 'nodeModulesDir' during up-to-date check.
           [exec] 	at org.gradle.api.internal.changedetection.state.CacheBackedTaskHistoryRepository.fingerprintTaskFiles(CacheBackedTaskHistoryRepository.java:360)
           [exec] 	at org.gradle.api.internal.changedetection.state.CacheBackedTaskHistoryRepository.updateExecution(CacheBackedTaskHistoryRepository.java:182)
           [exec] 	at org.gradle.api.internal.changedetection.state.CacheBackedTaskHistoryRepository.access$200(CacheBackedTaskHistoryRepository.java:76)
           [exec] 	at org.gradle.api.internal.changedetection.state.CacheBackedTaskHistoryRepository$1.updateCurrentExecution(CacheBackedTaskHistoryRepository.java:130)
           [exec] 	at org.gradle.api.internal.changedetection.changes.DefaultTaskArtifactStateRepository$TaskArtifactStateImpl.snapshotAfterTaskExecution(DefaultTaskArtifactStateRepository.java:172)
           [exec] 	at org.gradle.api.internal.tasks.execution.ExecuteActionsTaskExecuter.execute(ExecuteActionsTaskExecuter.java:85)
           [exec] 	at org.gradle.api.internal.tasks.execution.OutputDirectoryCreatingTaskExecuter.execute(OutputDirectoryCreatingTaskExecuter.java:51)
           [exec] 	at org.gradle.api.internal.tasks.execution.SkipUpToDateTaskExecuter.execute(SkipUpToDateTaskExecuter.java:59)
           [exec] 	at org.gradle.api.internal.tasks.execution.ResolveTaskOutputCachingStateExecuter.execute(ResolveTaskOutputCachingStateExecuter.java:54)
           [exec] 	at org.gradle.api.internal.tasks.execution.ValidatingTaskExecuter.execute(ValidatingTaskExecuter.java:59)
           [exec] 	at org.gradle.api.internal.tasks.execution.SkipEmptySourceFilesTaskExecuter.execute(SkipEmptySourceFilesTaskExecuter.java:101)
           [exec] 	at org.gradle.api.internal.tasks.execution.FinalizeInputFilePropertiesTaskExecuter.execute(FinalizeInputFilePropertiesTaskExecuter.java:44)
           [exec] 	at org.gradle.api.internal.tasks.execution.CleanupStaleOutputsExecuter.execute(CleanupStaleOutputsExecuter.java:91)
           [exec] 	at org.gradle.api.internal.tasks.execution.ResolveTaskArtifactStateTaskExecuter.execute(ResolveTaskArtifactStateTaskExecuter.java:62)
           [exec] 	at org.gradle.api.internal.tasks.execution.SkipTaskWithNoActionsExecuter.execute(SkipTaskWithNoActionsExecuter.java:59)
           [exec] 	at org.gradle.api.internal.tasks.execution.SkipOnlyIfTaskExecuter.execute(SkipOnlyIfTaskExecuter.java:54)
           [exec] 	at org.gradle.api.internal.tasks.execution.ExecuteAtMostOnceTaskExecuter.execute(ExecuteAtMostOnceTaskExecuter.java:43)
           [exec] 	at org.gradle.api.internal.tasks.execution.CatchExceptionTaskExecuter.execute(CatchExceptionTaskExecuter.java:34)
           [exec] 	at org.gradle.api.internal.tasks.execution.EventFiringTaskExecuter$1.run(EventFiringTaskExecuter.java:51)
           [exec] 	at org.gradle.internal.operations.DefaultBuildOperationExecutor$RunnableBuildOperationWorker.execute(DefaultBuildOperationExecutor.java:300)
           [exec] 	at org.gradle.internal.operations.DefaultBuildOperationExecutor$RunnableBuildOperationWorker.execute(DefaultBuildOperationExecutor.java:292)
           [exec] 	at org.gradle.internal.operations.DefaultBuildOperationExecutor.execute(DefaultBuildOperationExecutor.java:174)
           [exec] 	at org.gradle.internal.operations.DefaultBuildOperationExecutor.run(DefaultBuildOperationExecutor.java:90)
           [exec] 	at org.gradle.internal.operations.DelegatingBuildOperationExecutor.run(DelegatingBuildOperationExecutor.java:31)
           [exec] 	at org.gradle.api.internal.tasks.execution.EventFiringTaskExecuter.execute(EventFiringTaskExecuter.java:46)
           [exec] 	at org.gradle.execution.taskgraph.LocalTaskInfoExecutor.execute(LocalTaskInfoExecutor.java:42)
           [exec] 	at org.gradle.execution.taskgraph.DefaultTaskExecutionGraph$BuildOperationAwareWorkItemExecutor.execute(DefaultTaskExecutionGraph.java:277)
           [exec] 	at org.gradle.execution.taskgraph.DefaultTaskExecutionGraph$BuildOperationAwareWorkItemExecutor.execute(DefaultTaskExecutionGraph.java:262)
           [exec] 	at org.gradle.execution.taskgraph.DefaultTaskPlanExecutor$ExecutorWorker$1.execute(DefaultTaskPlanExecutor.java:135)
           [exec] 	at org.gradle.execution.taskgraph.DefaultTaskPlanExecutor$ExecutorWorker$1.execute(DefaultTaskPlanExecutor.java:130)
           [exec] 	at org.gradle.execution.taskgraph.DefaultTaskPlanExecutor$ExecutorWorker.execute(DefaultTaskPlanExecutor.java:200)
           [exec] 	at org.gradle.execution.taskgraph.DefaultTaskPlanExecutor$ExecutorWorker.executeWithWork(DefaultTaskPlanExecutor.java:191)
           [exec] 	at org.gradle.execution.taskgraph.DefaultTaskPlanExecutor$ExecutorWorker.run(DefaultTaskPlanExecutor.java:130)
           [exec] 	at org.gradle.internal.concurrent.ExecutorPolicy$CatchAndRecordFailures.onExecute(ExecutorPolicy.java:63)
           [exec] 	at org.gradle.internal.concurrent.ManagedExecutorImpl$1.run(ManagedExecutorImpl.java:46)
           [exec] 	at org.gradle.internal.concurrent.ThreadFactoryImpl$ManagedThreadRunnable.run(ThreadFactoryImpl.java:55)
           [exec] Caused by: org.gradle.api.GradleException: Could not list contents of '/opt/dev/projects/github/liferay-portal-7.1.x-private/modules/apps/frontend-theme/frontend-theme-admin/node_modules/.bin/node-gyp'. Couldn't follow symbolic link.
           [exec] 	at org.gradle.api.internal.changedetection.state.mirror.MirrorUpdatingDirectoryWalker$1.visitFile(MirrorUpdatingDirectoryWalker.java:97)
           [exec] 	at org.gradle.api.internal.changedetection.state.mirror.MirrorUpdatingDirectoryWalker$1.visitFile(MirrorUpdatingDirectoryWalker.java:76)
           [exec] 	at org.gradle.api.internal.changedetection.state.mirror.MirrorUpdatingDirectoryWalker.walkDir(MirrorUpdatingDirectoryWalker.java:76)
           [exec] 	at org.gradle.api.internal.changedetection.state.DefaultFileSystemSnapshotter.snapshot(DefaultFileSystemSnapshotter.java:181)
           [exec] 	at org.gradle.api.internal.changedetection.state.DefaultFileSystemSnapshotter.snapshotAndCache(DefaultFileSystemSnapshotter.java:165)
           [exec] 	at org.gradle.api.internal.changedetection.state.DefaultFileSystemSnapshotter.snapshotAndCache(DefaultFileSystemSnapshotter.java:149)
           [exec] 	at org.gradle.api.internal.changedetection.state.DefaultFileSystemSnapshotter.access$200(DefaultFileSystemSnapshotter.java:65)
           [exec] 	at org.gradle.api.internal.changedetection.state.DefaultFileSystemSnapshotter$2.create(DefaultFileSystemSnapshotter.java:132)
           [exec] 	at org.gradle.api.internal.changedetection.state.DefaultFileSystemSnapshotter$2.create(DefaultFileSystemSnapshotter.java:129)
           [exec] 	at org.gradle.cache.internal.ProducerGuard$StripedProducerGuard.guardByKey(ProducerGuard.java:115)
           [exec] 	at org.gradle.api.internal.changedetection.state.DefaultFileSystemSnapshotter.snapshot(DefaultFileSystemSnapshotter.java:129)
           [exec] 	at org.gradle.api.internal.changedetection.state.DefaultFileSystemSnapshotter$FileCollectionVisitorImpl.visitCollection(DefaultFileSystemSnapshotter.java:258)
           [exec] 	at org.gradle.api.internal.file.AbstractFileCollection.visitRootElements(AbstractFileCollection.java:282)
           [exec] 	at org.gradle.api.internal.file.CompositeFileCollection.visitRootElements(CompositeFileCollection.java:206)
           [exec] 	at org.gradle.api.internal.changedetection.state.DefaultFileSystemSnapshotter.snapshot(DefaultFileSystemSnapshotter.java:142)
           [exec] 	at org.gradle.internal.fingerprint.impl.AbstractFileCollectionFingerprinter.fingerprint(AbstractFileCollectionFingerprinter.java:54)
           [exec] 	at org.gradle.internal.fingerprint.impl.AbstractPathOnlyFileCollectionFingerprinter.fingerprint(AbstractPathOnlyFileCollectionFingerprinter.java:37)
           [exec] 	at org.gradle.api.internal.changedetection.state.CacheBackedTaskHistoryRepository.fingerprintTaskFiles(CacheBackedTaskHistoryRepository.java:358)
           [exec] 	... 35 more
           [exec] 
           [exec] ==============================================================================
           [exec] 
           [exec] 2: Task failed with an exception.
           [exec] -----------
           [exec] * What went wrong:
           [exec] Failed to capture fingerprint of output files for task ':apps:frontend-theme-westeros-bank:frontend-theme-westeros-bank:npmInstall' property 'nodeModulesDir' during up-to-date check.
           [exec] > Could not list contents of '/opt/dev/projects/github/liferay-portal-7.1.x-private/modules/apps/frontend-theme-westeros-bank/frontend-theme-westeros-bank/node_modules/.bin/node-gyp'. Couldn't follow symbolic link.
           [exec] 
           [exec] * Try:
           [exec] Run with --info or --debug option to get more log output. Run with --scan to get full insights.
           [exec] 
           [exec] * Exception is:
           [exec] org.gradle.api.UncheckedIOException: Failed to capture fingerprint of output files for task ':apps:frontend-theme-westeros-bank:frontend-theme-westeros-bank:npmInstall' property 'nodeModulesDir' during up-to-date check.
           [exec] 	at org.gradle.api.internal.changedetection.state.CacheBackedTaskHistoryRepository.fingerprintTaskFiles(CacheBackedTaskHistoryRepository.java:360)
           [exec] 	at org.gradle.api.internal.changedetection.state.CacheBackedTaskHistoryRepository.updateExecution(CacheBackedTaskHistoryRepository.java:182)
           [exec] 	at org.gradle.api.internal.changedetection.state.CacheBackedTaskHistoryRepository.access$200(CacheBackedTaskHistoryRepository.java:76)
           [exec] 	at org.gradle.api.internal.changedetection.state.CacheBackedTaskHistoryRepository$1.updateCurrentExecution(CacheBackedTaskHistoryRepository.java:130)
           [exec] 	at org.gradle.api.internal.changedetection.changes.DefaultTaskArtifactStateRepository$TaskArtifactStateImpl.snapshotAfterTaskExecution(DefaultTaskArtifactStateRepository.java:172)
           [exec] 	at org.gradle.api.internal.tasks.execution.ExecuteActionsTaskExecuter.execute(ExecuteActionsTaskExecuter.java:85)
           [exec] 	at org.gradle.api.internal.tasks.execution.OutputDirectoryCreatingTaskExecuter.execute(OutputDirectoryCreatingTaskExecuter.java:51)
           [exec] 	at org.gradle.api.internal.tasks.execution.SkipUpToDateTaskExecuter.execute(SkipUpToDateTaskExecuter.java:59)
           [exec] 	at org.gradle.api.internal.tasks.execution.ResolveTaskOutputCachingStateExecuter.execute(ResolveTaskOutputCachingStateExecuter.java:54)
           [exec] 	at org.gradle.api.internal.tasks.execution.ValidatingTaskExecuter.execute(ValidatingTaskExecuter.java:59)
           [exec] 	at org.gradle.api.internal.tasks.execution.SkipEmptySourceFilesTaskExecuter.execute(SkipEmptySourceFilesTaskExecuter.java:101)
           [exec] 	at org.gradle.api.internal.tasks.execution.FinalizeInputFilePropertiesTaskExecuter.execute(FinalizeInputFilePropertiesTaskExecuter.java:44)
           [exec] 	at org.gradle.api.internal.tasks.execution.CleanupStaleOutputsExecuter.execute(CleanupStaleOutputsExecuter.java:91)
           [exec] 	at org.gradle.api.internal.tasks.execution.ResolveTaskArtifactStateTaskExecuter.execute(ResolveTaskArtifactStateTaskExecuter.java:62)
           [exec] 	at org.gradle.api.internal.tasks.execution.SkipTaskWithNoActionsExecuter.execute(SkipTaskWithNoActionsExecuter.java:59)
           [exec] 	at org.gradle.api.internal.tasks.execution.SkipOnlyIfTaskExecuter.execute(SkipOnlyIfTaskExecuter.java:54)
           [exec] 	at org.gradle.api.internal.tasks.execution.ExecuteAtMostOnceTaskExecuter.execute(ExecuteAtMostOnceTaskExecuter.java:43)
           [exec] 	at org.gradle.api.internal.tasks.execution.CatchExceptionTaskExecuter.execute(CatchExceptionTaskExecuter.java:34)
           [exec] 	at org.gradle.api.internal.tasks.execution.EventFiringTaskExecuter$1.run(EventFiringTaskExecuter.java:51)
           [exec] 	at org.gradle.internal.operations.DefaultBuildOperationExecutor$RunnableBuildOperationWorker.execute(DefaultBuildOperationExecutor.java:300)
           [exec] 	at org.gradle.internal.operations.DefaultBuildOperationExecutor$RunnableBuildOperationWorker.execute(DefaultBuildOperationExecutor.java:292)
           [exec] 	at org.gradle.internal.operations.DefaultBuildOperationExecutor.execute(DefaultBuildOperationExecutor.java:174)
           [exec] 	at org.gradle.internal.operations.DefaultBuildOperationExecutor.run(DefaultBuildOperationExecutor.java:90)
           [exec] 	at org.gradle.internal.operations.DelegatingBuildOperationExecutor.run(DelegatingBuildOperationExecutor.java:31)
           [exec] 	at org.gradle.api.internal.tasks.execution.EventFiringTaskExecuter.execute(EventFiringTaskExecuter.java:46)
           [exec] 	at org.gradle.execution.taskgraph.LocalTaskInfoExecutor.execute(LocalTaskInfoExecutor.java:42)
           [exec] 	at org.gradle.execution.taskgraph.DefaultTaskExecutionGraph$BuildOperationAwareWorkItemExecutor.execute(DefaultTaskExecutionGraph.java:277)
           [exec] 	at org.gradle.execution.taskgraph.DefaultTaskExecutionGraph$BuildOperationAwareWorkItemExecutor.execute(DefaultTaskExecutionGraph.java:262)
           [exec] 	at org.gradle.execution.taskgraph.DefaultTaskPlanExecutor$ExecutorWorker$1.execute(DefaultTaskPlanExecutor.java:135)
           [exec] 	at org.gradle.execution.taskgraph.DefaultTaskPlanExecutor$ExecutorWorker$1.execute(DefaultTaskPlanExecutor.java:130)
           [exec] 	at org.gradle.execution.taskgraph.DefaultTaskPlanExecutor$ExecutorWorker.execute(DefaultTaskPlanExecutor.java:200)
           [exec] 	at org.gradle.execution.taskgraph.DefaultTaskPlanExecutor$ExecutorWorker.executeWithWork(DefaultTaskPlanExecutor.java:191)
           [exec] 	at org.gradle.execution.taskgraph.DefaultTaskPlanExecutor$ExecutorWorker.run(DefaultTaskPlanExecutor.java:130)
           [exec] 	at org.gradle.internal.concurrent.ExecutorPolicy$CatchAndRecordFailures.onExecute(ExecutorPolicy.java:63)
           [exec] 	at org.gradle.internal.concurrent.ManagedExecutorImpl$1.run(ManagedExecutorImpl.java:46)
           [exec] 	at java.util.concurrent.ThreadPoolExecutor.runWorker(ThreadPoolExecutor.java:1142)
           [exec] 	at java.util.concurrent.ThreadPoolExecutor$Worker.run(ThreadPoolExecutor.java:617)
           [exec] 	at org.gradle.internal.concurrent.ThreadFactoryImpl$ManagedThreadRunnable.run(ThreadFactoryImpl.java:55)
           [exec] 	at java.lang.Thread.run(Thread.java:745)
           [exec] Caused by: org.gradle.api.GradleException: Could not list contents of '/opt/dev/projects/github/liferay-portal-7.1.x-private/modules/apps/frontend-theme-westeros-bank/frontend-theme-westeros-bank/node_modules/.bin/node-gyp'. Couldn't follow symbolic link.
           [exec] 	at org.gradle.api.internal.changedetection.state.mirror.MirrorUpdatingDirectoryWalker$1.visitFile(MirrorUpdatingDirectoryWalker.java:97)
           [exec] 	at org.gradle.api.internal.changedetection.state.mirror.MirrorUpdatingDirectoryWalker$1.visitFile(MirrorUpdatingDirectoryWalker.java:76)
           [exec] 	at java.nio.file.Files.walkFileTree(Files.java:2670)
           [exec] 	at org.gradle.api.internal.changedetection.state.mirror.MirrorUpdatingDirectoryWalker.walkDir(MirrorUpdatingDirectoryWalker.java:76)
           [exec] 	at org.gradle.api.internal.changedetection.state.DefaultFileSystemSnapshotter.snapshot(DefaultFileSystemSnapshotter.java:181)
           [exec] 	at org.gradle.api.internal.changedetection.state.DefaultFileSystemSnapshotter.snapshotAndCache(DefaultFileSystemSnapshotter.java:165)
           [exec] 	at org.gradle.api.internal.changedetection.state.DefaultFileSystemSnapshotter.snapshotAndCache(DefaultFileSystemSnapshotter.java:149)
           [exec] 	at org.gradle.api.internal.changedetection.state.DefaultFileSystemSnapshotter.access$200(DefaultFileSystemSnapshotter.java:65)
           [exec] 	at org.gradle.api.internal.changedetection.state.DefaultFileSystemSnapshotter$2.create(DefaultFileSystemSnapshotter.java:132)
           [exec] 	at org.gradle.api.internal.changedetection.state.DefaultFileSystemSnapshotter$2.create(DefaultFileSystemSnapshotter.java:129)
           [exec] 	at org.gradle.cache.internal.ProducerGuard$StripedProducerGuard.guardByKey(ProducerGuard.java:115)
           [exec] 	at org.gradle.api.internal.changedetection.state.DefaultFileSystemSnapshotter.snapshot(DefaultFileSystemSnapshotter.java:129)
           [exec] 	at org.gradle.api.internal.changedetection.state.DefaultFileSystemSnapshotter$FileCollectionVisitorImpl.visitCollection(DefaultFileSystemSnapshotter.java:258)
           [exec] 	at org.gradle.api.internal.file.AbstractFileCollection.visitRootElements(AbstractFileCollection.java:282)
           [exec] 	at org.gradle.api.internal.file.CompositeFileCollection.visitRootElements(CompositeFileCollection.java:206)
           [exec] 	at org.gradle.api.internal.changedetection.state.DefaultFileSystemSnapshotter.snapshot(DefaultFileSystemSnapshotter.java:142)
           [exec] 	at org.gradle.internal.fingerprint.impl.AbstractFileCollectionFingerprinter.fingerprint(AbstractFileCollectionFingerprinter.java:54)
           [exec] 	at org.gradle.internal.fingerprint.impl.AbstractPathOnlyFileCollectionFingerprinter.fingerprint(AbstractPathOnlyFileCollectionFingerprinter.java:37)
           [exec] 	at org.gradle.api.internal.changedetection.state.CacheBackedTaskHistoryRepository.fingerprintTaskFiles(CacheBackedTaskHistoryRepository.java:358)
           [exec] 	... 38 more
           [exec] 
           [exec] ==============================================================================
           [exec] 
           [exec] 3: Task failed with an exception.
           [exec] -----------
           [exec] * What went wrong:
           [exec] Failed to capture fingerprint of output files for task ':apps:frontend-theme:frontend-theme-classic:npmInstall' property 'nodeModulesDir' during up-to-date check.
           [exec] > Could not list contents of '/opt/dev/projects/github/liferay-portal-7.1.x-private/modules/apps/frontend-theme/frontend-theme-classic/node_modules/.bin/node-gyp'. Couldn't follow symbolic link.
           [exec] 
           [exec] * Try:
           [exec] Run with --info or --debug option to get more log output. Run with --scan to get full insights.
           [exec] 
           [exec] * Exception is:
           [exec] org.gradle.api.UncheckedIOException: Failed to capture fingerprint of output files for task ':apps:frontend-theme:frontend-theme-classic:npmInstall' property 'nodeModulesDir' during up-to-date check.
           [exec] 	at org.gradle.api.internal.changedetection.state.CacheBackedTaskHistoryRepository.fingerprintTaskFiles(CacheBackedTaskHistoryRepository.java:360)
           [exec] 	at org.gradle.api.internal.changedetection.state.CacheBackedTaskHistoryRepository.updateExecution(CacheBackedTaskHistoryRepository.java:182)
           [exec] 	at org.gradle.api.internal.changedetection.state.CacheBackedTaskHistoryRepository.access$200(CacheBackedTaskHistoryRepository.java:76)
           [exec] 	at org.gradle.api.internal.changedetection.state.CacheBackedTaskHistoryRepository$1.updateCurrentExecution(CacheBackedTaskHistoryRepository.java:130)
           [exec] 	at org.gradle.api.internal.changedetection.changes.DefaultTaskArtifactStateRepository$TaskArtifactStateImpl.snapshotAfterTaskExecution(DefaultTaskArtifactStateRepository.java:172)
           [exec] 	at org.gradle.api.internal.tasks.execution.ExecuteActionsTaskExecuter.execute(ExecuteActionsTaskExecuter.java:85)
           [exec] 	at org.gradle.api.internal.tasks.execution.OutputDirectoryCreatingTaskExecuter.execute(OutputDirectoryCreatingTaskExecuter.java:51)
           [exec] 	at org.gradle.api.internal.tasks.execution.SkipUpToDateTaskExecuter.execute(SkipUpToDateTaskExecuter.java:59)
           [exec] 	at org.gradle.api.internal.tasks.execution.ResolveTaskOutputCachingStateExecuter.execute(ResolveTaskOutputCachingStateExecuter.java:54)
           [exec] 	at org.gradle.api.internal.tasks.execution.ValidatingTaskExecuter.execute(ValidatingTaskExecuter.java:59)
           [exec] 	at org.gradle.api.internal.tasks.execution.SkipEmptySourceFilesTaskExecuter.execute(SkipEmptySourceFilesTaskExecuter.java:101)
           [exec] 	at org.gradle.api.internal.tasks.execution.FinalizeInputFilePropertiesTaskExecuter.execute(FinalizeInputFilePropertiesTaskExecuter.java:44)
           [exec] 	at org.gradle.api.internal.tasks.execution.CleanupStaleOutputsExecuter.execute(CleanupStaleOutputsExecuter.java:91)
           [exec] 	at org.gradle.api.internal.tasks.execution.ResolveTaskArtifactStateTaskExecuter.execute(ResolveTaskArtifactStateTaskExecuter.java:62)
           [exec] 	at org.gradle.api.internal.tasks.execution.SkipTaskWithNoActionsExecuter.execute(SkipTaskWithNoActionsExecuter.java:59)
           [exec] 	at org.gradle.api.internal.tasks.execution.SkipOnlyIfTaskExecuter.execute(SkipOnlyIfTaskExecuter.java:54)
           [exec] 	at org.gradle.api.internal.tasks.execution.ExecuteAtMostOnceTaskExecuter.execute(ExecuteAtMostOnceTaskExecuter.java:43)
           [exec] 	at org.gradle.api.internal.tasks.execution.CatchExceptionTaskExecuter.execute(CatchExceptionTaskExecuter.java:34)
           [exec] 	at org.gradle.api.internal.tasks.execution.EventFiringTaskExecuter$1.run(EventFiringTaskExecuter.java:51)
           [exec] 	at org.gradle.internal.operations.DefaultBuildOperationExecutor$RunnableBuildOperationWorker.execute(DefaultBuildOperationExecutor.java:300)
           [exec] 	at org.gradle.internal.operations.DefaultBuildOperationExecutor$RunnableBuildOperationWorker.execute(DefaultBuildOperationExecutor.java:292)
           [exec] 	at org.gradle.internal.operations.DefaultBuildOperationExecutor.execute(DefaultBuildOperationExecutor.java:174)
           [exec] 	at org.gradle.internal.operations.DefaultBuildOperationExecutor.run(DefaultBuildOperationExecutor.java:90)
           [exec] 	at org.gradle.internal.operations.DelegatingBuildOperationExecutor.run(DelegatingBuildOperationExecutor.java:31)
           [exec] 	at org.gradle.api.internal.tasks.execution.EventFiringTaskExecuter.execute(EventFiringTaskExecuter.java:46)
           [exec] 	at org.gradle.execution.taskgraph.LocalTaskInfoExecutor.execute(LocalTaskInfoExecutor.java:42)
           [exec] 	at org.gradle.execution.taskgraph.DefaultTaskExecutionGraph$BuildOperationAwareWorkItemExecutor.execute(DefaultTaskExecutionGraph.java:277)
           [exec] 	at org.gradle.execution.taskgraph.DefaultTaskExecutionGraph$BuildOperationAwareWorkItemExecutor.execute(DefaultTaskExecutionGraph.java:262)
           [exec] 	at org.gradle.execution.taskgraph.DefaultTaskPlanExecutor$ExecutorWorker$1.execute(DefaultTaskPlanExecutor.java:135)
           [exec] 	at org.gradle.execution.taskgraph.DefaultTaskPlanExecutor$ExecutorWorker$1.execute(DefaultTaskPlanExecutor.java:130)
           [exec] 	at org.gradle.execution.taskgraph.DefaultTaskPlanExecutor$ExecutorWorker.execute(DefaultTaskPlanExecutor.java:200)
           [exec] 	at org.gradle.execution.taskgraph.DefaultTaskPlanExecutor$ExecutorWorker.executeWithWork(DefaultTaskPlanExecutor.java:191)
           [exec] 	at org.gradle.execution.taskgraph.DefaultTaskPlanExecutor$ExecutorWorker.run(DefaultTaskPlanExecutor.java:130)
           [exec] 	at org.gradle.internal.concurrent.ExecutorPolicy$CatchAndRecordFailures.onExecute(ExecutorPolicy.java:63)
           [exec] 	at org.gradle.internal.concurrent.ManagedExecutorImpl$1.run(ManagedExecutorImpl.java:46)
           [exec] 	at java.util.concurrent.ThreadPoolExecutor.runWorker(ThreadPoolExecutor.java:1142)
           [exec] 	at java.util.concurrent.ThreadPoolExecutor$Worker.run(ThreadPoolExecutor.java:617)
           [exec] 	at org.gradle.internal.concurrent.ThreadFactoryImpl$ManagedThreadRunnable.run(ThreadFactoryImpl.java:55)
           [exec] 	at java.lang.Thread.run(Thread.java:745)
           [exec] Caused by: org.gradle.api.GradleException: Could not list contents of '/opt/dev/projects/github/liferay-portal-7.1.x-private/modules/apps/frontend-theme/frontend-theme-classic/node_modules/.bin/node-gyp'. Couldn't follow symbolic link.
           [exec] 	at org.gradle.api.internal.changedetection.state.mirror.MirrorUpdatingDirectoryWalker$1.visitFile(MirrorUpdatingDirectoryWalker.java:97)
           [exec] 	at org.gradle.api.internal.changedetection.state.mirror.MirrorUpdatingDirectoryWalker$1.visitFile(MirrorUpdatingDirectoryWalker.java:76)
           [exec] 	at java.nio.file.Files.walkFileTree(Files.java:2670)
           [exec] 	at org.gradle.api.internal.changedetection.state.mirror.MirrorUpdatingDirectoryWalker.walkDir(MirrorUpdatingDirectoryWalker.java:76)
           [exec] 	at org.gradle.api.internal.changedetection.state.DefaultFileSystemSnapshotter.snapshot(DefaultFileSystemSnapshotter.java:181)
           [exec] 	at org.gradle.api.internal.changedetection.state.DefaultFileSystemSnapshotter.snapshotAndCache(DefaultFileSystemSnapshotter.java:165)
           [exec] 	at org.gradle.api.internal.changedetection.state.DefaultFileSystemSnapshotter.snapshotAndCache(DefaultFileSystemSnapshotter.java:149)
           [exec] 	at org.gradle.api.internal.changedetection.state.DefaultFileSystemSnapshotter.access$200(DefaultFileSystemSnapshotter.java:65)
           [exec] 	at org.gradle.api.internal.changedetection.state.DefaultFileSystemSnapshotter$2.create(DefaultFileSystemSnapshotter.java:132)
           [exec] 	at org.gradle.api.internal.changedetection.state.DefaultFileSystemSnapshotter$2.create(DefaultFileSystemSnapshotter.java:129)
           [exec] 	at org.gradle.cache.internal.ProducerGuard$StripedProducerGuard.guardByKey(ProducerGuard.java:115)
           [exec] 	at org.gradle.api.internal.changedetection.state.DefaultFileSystemSnapshotter.snapshot(DefaultFileSystemSnapshotter.java:129)
           [exec] 	at org.gradle.api.internal.changedetection.state.DefaultFileSystemSnapshotter$FileCollectionVisitorImpl.visitCollection(DefaultFileSystemSnapshotter.java:258)
           [exec] 	at org.gradle.api.internal.file.AbstractFileCollection.visitRootElements(AbstractFileCollection.java:282)
           [exec] 	at org.gradle.api.internal.file.CompositeFileCollection.visitRootElements(CompositeFileCollection.java:206)
           [exec] 	at org.gradle.api.internal.changedetection.state.DefaultFileSystemSnapshotter.snapshot(DefaultFileSystemSnapshotter.java:142)
           [exec] 	at org.gradle.internal.fingerprint.impl.AbstractFileCollectionFingerprinter.fingerprint(AbstractFileCollectionFingerprinter.java:54)
           [exec] 	at org.gradle.internal.fingerprint.impl.AbstractPathOnlyFileCollectionFingerprinter.fingerprint(AbstractPathOnlyFileCollectionFingerprinter.java:37)
           [exec] 	at org.gradle.api.internal.changedetection.state.CacheBackedTaskHistoryRepository.fingerprintTaskFiles(CacheBackedTaskHistoryRepository.java:358)
           [exec] 	... 38 more
           [exec] 
           [exec] ==============================================================================
           [exec] 
           [exec] * Get more help at https://help.gradle.org
           [exec] 
           [exec] BUILD FAILED in 38m 1s
      

        Attachments

          Issue Links

            Activity

              People

              • Votes:
                0 Vote for this issue
                Watchers:
                5 Start watching this issue

                Dates

                • Created:
                  Updated:
                  Resolved:
                  Days since last comment:
                  36 weeks ago

                  Packages

                  Version Package
                  7.1.X