Details

    • Type: Task
    • Status: Closed
    • Priority: Minor
    • Resolution: Completed
    • Affects Version/s: None
    • Fix Version/s: Master
    • Labels:
      None

      Description

      https://test-1-3.liferay.com/job/test-portal-upstream-batch(master)/AXIS_VARIABLE=0,label_exp=!master/13202/consoleFull

      Detailed Report

      org.gradle.testkit.runner.UnexpectedBuildFailure: Unexpected build execution failure in /opt/dev/projects/github/liferay-portal/modules/sdk/gradle-plugins-gulp/build/gradleTest/SmokeGroovyDSL/4.10.2 with arguments [runGradleTest, --init-script, /opt/dev/projects/github/liferay-portal/modules/sdk/gradle-plugins-gulp/build/gradleTest/init.gradle, --full-stacktrace, --info, --console=plain]
      
      Output:
      The client will now receive all logging from the daemon (pid: 9800). The daemon log file: /tmp/.gradle-test-kit-root/test-kit-daemon/4.10.2/daemon-9800.out.log
      Starting build in new daemon [memory: 954.7 MB]
      Closing daemon's stdin at end of input.
      The daemon will no longer process any standard input.
      Using 8 worker leases.
      Starting Build
      Compiling initialization script '/opt/dev/projects/github/liferay-portal/modules/sdk/gradle-plugins-gulp/build/gradleTest/init.gradle' using SubsetScriptTransformer.
      Compiling initialization script '/opt/dev/projects/github/liferay-portal/modules/sdk/gradle-plugins-gulp/build/gradleTest/init.gradle' using BuildScriptTransformer.
      Settings evaluated using settings file '/opt/dev/projects/github/liferay-portal/modules/sdk/gradle-plugins-gulp/build/gradleTest/SmokeGroovyDSL/4.10.2/settings.gradle'.
      Projects loaded. Root project using build file '/opt/dev/projects/github/liferay-portal/modules/sdk/gradle-plugins-gulp/build/gradleTest/SmokeGroovyDSL/4.10.2/build.gradle'.
      Included projects: [root project '4.10.2']
      
      > Configure project :
      Evaluating root project '4.10.2' using build file '/opt/dev/projects/github/liferay-portal/modules/sdk/gradle-plugins-gulp/build/gradleTest/SmokeGroovyDSL/4.10.2/build.gradle'.
      Compiling build file '/opt/dev/projects/github/liferay-portal/modules/sdk/gradle-plugins-gulp/build/gradleTest/SmokeGroovyDSL/4.10.2/build.gradle' using SubsetScriptTransformer.
      Compiling build file '/opt/dev/projects/github/liferay-portal/modules/sdk/gradle-plugins-gulp/build/gradleTest/SmokeGroovyDSL/4.10.2/build.gradle' using BuildScriptTransformer.
      All projects evaluated.
      Selected primary task 'runGradleTest' from project :
      Tasks to be executed: [task ':downloadNode', task ':npmInstall', task ':gulpHello', task ':runGradleTest']
      :downloadNode (Thread[Task worker for ':' Thread 5,5,main]) started.
      
      > Task :downloadNode
      Task ':downloadNode' is not up-to-date because:
        No history is available.
      Trying to download http://mirrors.lax.liferay.com/nodejs.org/dist/v5.5.0/node-v5.5.0-linux-x64.tar.gz to /root/.liferay/mirrors/nodejs.org/dist/v5.5.0/node-v5.5.0-linux-x64.tar.gz.tmp
      [ant:get] Getting: http://mirrors.lax.liferay.com/nodejs.org/dist/v5.5.0/node-v5.5.0-linux-x64.tar.gz
      [ant:get] To: /root/.liferay/mirrors/nodejs.org/dist/v5.5.0/node-v5.5.0-linux-x64.tar.gz.tmp
      :downloadNode (Thread[Task worker for ':' Thread 5,5,main]) completed. Took 1.658 secs.
      :npmInstall (Thread[Task worker for ':' Thread 5,5,main]) started.
      
      > Task :npmInstall FAILED
      Task ':npmInstall' is not up-to-date because:
        No history is available.
      Cache for task ':npmInstall' is disabled
      :npmInstall (Thread[Task worker for ':' Thread 5,5,main]) completed. Took 0.024 secs.
      
      FAILURE: Build failed with an exception.
      
      * What went wrong:
      Execution failed for task ':npmInstall'.
      > org/apache/commons/io/output/TeeOutputStream
      
      * Try:
      Run with --debug option to get more log output. Run with --scan to get full insights.
      
      * Exception is:
      org.gradle.api.tasks.TaskExecutionException: Execution failed for task ':npmInstall'.
      	at org.gradle.api.internal.tasks.execution.ExecuteActionsTaskExecuter.executeActions(ExecuteActionsTaskExecuter.java:110)
      	at org.gradle.api.internal.tasks.execution.ExecuteActionsTaskExecuter.execute(ExecuteActionsTaskExecuter.java:77)
      	at org.gradle.api.internal.tasks.execution.OutputDirectoryCreatingTaskExecuter.execute(OutputDirectoryCreatingTaskExecuter.java:51)
      	at org.gradle.api.internal.tasks.execution.SkipUpToDateTaskExecuter.execute(SkipUpToDateTaskExecuter.java:59)
      	at org.gradle.api.internal.tasks.execution.ResolveTaskOutputCachingStateExecuter.execute(ResolveTaskOutputCachingStateExecuter.java:54)
      	at org.gradle.api.internal.tasks.execution.ValidatingTaskExecuter.execute(ValidatingTaskExecuter.java:59)
      	at org.gradle.api.internal.tasks.execution.SkipEmptySourceFilesTaskExecuter.execute(SkipEmptySourceFilesTaskExecuter.java:101)
      	at org.gradle.api.internal.tasks.execution.FinalizeInputFilePropertiesTaskExecuter.execute(FinalizeInputFilePropertiesTaskExecuter.java:44)
      	at org.gradle.api.internal.tasks.execution.CleanupStaleOutputsExecuter.execute(CleanupStaleOutputsExecuter.java:91)
      	at org.gradle.api.internal.tasks.execution.ResolveTaskArtifactStateTaskExecuter.execute(ResolveTaskArtifactStateTaskExecuter.java:62)
      	at org.gradle.api.internal.tasks.execution.SkipTaskWithNoActionsExecuter.execute(SkipTaskWithNoActionsExecuter.java:59)
      	at org.gradle.api.internal.tasks.execution.SkipOnlyIfTaskExecuter.execute(SkipOnlyIfTaskExecuter.java:54)
      	at org.gradle.api.internal.tasks.execution.ExecuteAtMostOnceTaskExecuter.execute(ExecuteAtMostOnceTaskExecuter.java:43)
      	at org.gradle.api.internal.tasks.execution.CatchExceptionTaskExecuter.execute(CatchExceptionTaskExecuter.java:34)
      	at org.gradle.api.internal.tasks.execution.EventFiringTaskExecuter$1.run(EventFiringTaskExecuter.java:51)
      	at org.gradle.internal.operations.DefaultBuildOperationExecutor$RunnableBuildOperationWorker.execute(DefaultBuildOperationExecutor.java:300)
      	at org.gradle.internal.operations.DefaultBuildOperationExecutor$RunnableBuildOperationWorker.execute(DefaultBuildOperationExecutor.java:292)
      	at org.gradle.internal.operations.DefaultBuildOperationExecutor.execute(DefaultBuildOperationExecutor.java:174)
      	at org.gradle.internal.operations.DefaultBuildOperationExecutor.run(DefaultBuildOperationExecutor.java:90)
      	at org.gradle.internal.operations.DelegatingBuildOperationExecutor.run(DelegatingBuildOperationExecutor.java:31)
      	at org.gradle.api.internal.tasks.execution.EventFiringTaskExecuter.execute(EventFiringTaskExecuter.java:46)
      	at org.gradle.execution.taskgraph.LocalTaskInfoExecutor.execute(LocalTaskInfoExecutor.java:42)
      	at org.gradle.execution.taskgraph.DefaultTaskExecutionGraph$BuildOperationAwareWorkItemExecutor.execute(DefaultTaskExecutionGraph.java:277)
      	at org.gradle.execution.taskgraph.DefaultTaskExecutionGraph$BuildOperationAwareWorkItemExecutor.execute(DefaultTaskExecutionGraph.java:262)
      	at org.gradle.execution.taskgraph.DefaultTaskPlanExecutor$ExecutorWorker$1.execute(DefaultTaskPlanExecutor.java:135)
      	at org.gradle.execution.taskgraph.DefaultTaskPlanExecutor$ExecutorWorker$1.execute(DefaultTaskPlanExecutor.java:130)
      	at org.gradle.execution.taskgraph.DefaultTaskPlanExecutor$ExecutorWorker.execute(DefaultTaskPlanExecutor.java:200)
      	at org.gradle.execution.taskgraph.DefaultTaskPlanExecutor$ExecutorWorker.executeWithWork(DefaultTaskPlanExecutor.java:191)
      	at org.gradle.execution.taskgraph.DefaultTaskPlanExecutor$ExecutorWorker.run(DefaultTaskPlanExecutor.java:130)
      	at org.gradle.internal.concurrent.ExecutorPolicy$CatchAndRecordFailures.onExecute(ExecutorPolicy.java:63)
      	at org.gradle.internal.concurrent.ManagedExecutorImpl$1.run(ManagedExecutorImpl.java:46)
      	at java.util.concurrent.ThreadPoolExecutor.runWorker(ThreadPoolExecutor.java:1142)
      	at java.util.concurrent.ThreadPoolExecutor$Worker.run(ThreadPoolExecutor.java:617)
      	at org.gradle.internal.concurrent.ThreadFactoryImpl$ManagedThreadRunnable.run(ThreadFactoryImpl.java:55)
      	at java.lang.Thread.run(Thread.java:745)
      Caused by: java.lang.NoClassDefFoundError: org/apache/commons/io/output/TeeOutputStream
      	at com.liferay.gradle.plugins.node.internal.NodeExecutor._executeGradleExec(NodeExecutor.java:161)
      	at com.liferay.gradle.plugins.node.internal.NodeExecutor.execute(NodeExecutor.java:87)
      	at com.liferay.gradle.plugins.node.tasks.ExecuteNodeTask.executeNode(ExecuteNodeTask.java:77)
      	at com.liferay.gradle.plugins.node.tasks.ExecuteNodeScriptTask.executeNode(ExecuteNodeScriptTask.java:40)
      	at com.liferay.gradle.plugins.node.tasks.ExecuteNpmTask.executeNode(ExecuteNpmTask.java:108)
      	at com.liferay.gradle.plugins.node.tasks.NpmInstallTask._npmInstall(NpmInstallTask.java:526)
      	at com.liferay.gradle.plugins.node.tasks.NpmInstallTask.executeNpmInstall(NpmInstallTask.java:250)
      	at com.liferay.gradle.plugins.node.tasks.NpmInstallTask.executeNode(NpmInstallTask.java:103)
      	at sun.reflect.NativeMethodAccessorImpl.invoke0(Native Method)
      	at sun.reflect.NativeMethodAccessorImpl.invoke(NativeMethodAccessorImpl.java:62)
      	at sun.reflect.DelegatingMethodAccessorImpl.invoke(DelegatingMethodAccessorImpl.java:43)
      	at java.lang.reflect.Method.invoke(Method.java:498)
      	at org.gradle.internal.reflect.JavaMethod.invoke(JavaMethod.java:73)
      	at org.gradle.api.internal.project.taskfactory.StandardTaskAction.doExecute(StandardTaskAction.java:46)
      	at org.gradle.api.internal.project.taskfactory.StandardTaskAction.execute(StandardTaskAction.java:39)
      	at org.gradle.api.internal.project.taskfactory.StandardTaskAction.execute(StandardTaskAction.java:26)
      	at org.gradle.api.internal.AbstractTask$TaskActionWrapper.execute(AbstractTask.java:801)
      	at org.gradle.api.internal.AbstractTask$TaskActionWrapper.execute(AbstractTask.java:768)
      	at org.gradle.api.internal.tasks.execution.ExecuteActionsTaskExecuter$1.run(ExecuteActionsTaskExecuter.java:131)
      	at org.gradle.internal.operations.DefaultBuildOperationExecutor$RunnableBuildOperationWorker.execute(DefaultBuildOperationExecutor.java:300)
      	at org.gradle.internal.operations.DefaultBuildOperationExecutor$RunnableBuildOperationWorker.execute(DefaultBuildOperationExecutor.java:292)
      	at org.gradle.internal.operations.DefaultBuildOperationExecutor.execute(DefaultBuildOperationExecutor.java:174)
      	at org.gradle.internal.operations.DefaultBuildOperationExecutor.run(DefaultBuildOperationExecutor.java:90)
      	at org.gradle.internal.operations.DelegatingBuildOperationExecutor.run(DelegatingBuildOperationExecutor.java:31)
      	at org.gradle.api.internal.tasks.execution.ExecuteActionsTaskExecuter.executeAction(ExecuteActionsTaskExecuter.java:120)
      	at org.gradle.api.internal.tasks.execution.ExecuteActionsTaskExecuter.executeActions(ExecuteActionsTaskExecuter.java:99)
      	... 34 more
      Caused by: java.lang.ClassNotFoundException: org.apache.commons.io.output.TeeOutputStream
      	at java.net.URLClassLoader.findClass(URLClassLoader.java:381)
      	at java.lang.ClassLoader.loadClass(ClassLoader.java:424)
      	at java.lang.ClassLoader.loadClass(ClassLoader.java:357)
      	... 60 more
      
      
      * Get more help at https://help.gradle.org
      
      BUILD FAILED in 5s
      2 actionable tasks: 2 executed
      
      	at org.gradle.testkit.runner.internal.DefaultGradleRunner$1.execute(DefaultGradleRunner.java:237)
      	at org.gradle.testkit.runner.internal.DefaultGradleRunner$1.execute(DefaultGradleRunner.java:234)
      	at org.gradle.testkit.runner.internal.DefaultGradleRunner.run(DefaultGradleRunner.java:298)
      	at org.gradle.testkit.runner.internal.DefaultGradleRunner.build(DefaultGradleRunner.java:234)
      	at gradleTest.tests.SmokeGroovyDSLCompatibilitySpec.SmokeGroovyDSL : #version(SmokeGroovyDSLCompatibilitySpec.groovy:134)
      

        Attachments

          Activity

            People

            • Assignee:
              brian.chan Brian Chan
              Reporter:
              peter.shin Peter Shin
              Recent user:
              Lester Pi
              Participants of an Issue:
            • Votes:
              0 Vote for this issue
              Watchers:
              0 Start watching this issue

              Dates

              • Created:
                Updated:
                Resolved: