Details

    • Type: Regression Bug
    • Status: Closed
    • Resolution: No Longer Reproducible
    • Affects Version/s: 7.1.X
    • Fix Version/s: 7.1.X
    • Component/s: Core Infrastructure
    • Labels:
      None
    • Fix Priority:
      5
    • Sprint:
      021 - Spearow

      Description

      Steps to reproduce:

      1. Update to latest 7.1.x.
      2. Try to build the bundle.

      Actual Result:
      BUILD FAILED.

           [exec] > Task :apps:apio-architect:apio-architect-impl:compileJava
           [exec] /opt/dev/projects/github/liferay-portal-7.1.x/modules/apps/apio-architect/apio-architect-impl/src/main/java/com/liferay/apio/architect/internal/jaxrs/writer/FormMessageBodyWriter.java:219: error: illegal start of expression
           [exec] 	@Reference
           [exec] 	^
           [exec] /opt/dev/projects/github/liferay-portal-7.1.x/modules/apps/apio-architect/apio-architect-impl/src/main/java/com/liferay/apio/architect/internal/jaxrs/writer/FormMessageBodyWriter.java:219: error: ';' expected
           [exec] 	@Reference
           [exec] 	          ^
           [exec] 
           [exec] > Task :apps:apio-architect:apio-architect-api:processResources
           [exec] > Task :apps:apio-architect:apio-architect-api:transpileJS SKIPPED
           [exec] > Task :apps:apio-architect:apio-architect-api:configJSModules SKIPPED
           [exec] > Task :apps:apio-architect:apio-architect-api:copyLibs SKIPPED
           [exec] > Task :apps:apio-architect:apio-architect-api:replaceSoyTranslation NO-SOURCE
           [exec] > Task :apps:apio-architect:apio-architect-api:wrapSoyAlloyTemplate SKIPPED
           [exec] > Task :apps:apio-architect:apio-architect-api:classes
           [exec] > Task :apps:apio-architect:apio-architect-api:zipZippableResources UP-TO-DATE
           [exec] > Task :apps:apio-architect:apio-architect-exception-mapper-impl:autoUpdateXml SKIPPED
           [exec] > Task :apps:apio-architect:apio-architect-exception-mapper-impl:jar
           [exec] > Task :apps:apio-architect:apio-architect-exception-mapper-impl:restoreHotfixVersion
           [exec] 
           [exec] > Task :apps:apio-architect:apio-architect-exception-mapper-impl:deploy
           [exec] Files of project ':apps:apio-architect:apio-architect-exception-mapper-impl' deployed to /opt/dev/projects/github/liferay-portal-7.1.x/bundles/osgi/modules
           [exec] 
           [exec] > Task :apps:apio-architect:apio-architect-exception-mapper-impl:deployDependencies NO-SOURCE
           [exec] > Task :apps:apio-architect:apio-architect-exception-mapper-impl:deployConfigs NO-SOURCE
           [exec] 
           [exec] > Task :apps:apio-architect:apio-architect-impl:compileJava FAILED
           [exec] 2 errors
           [exec] 
           [exec] > Task :apps:apio-architect:apio-architect-uri-mapper-impl:autoUpdateXml SKIPPED
           [exec] > Task :apps:apio-architect:apio-architect-uri-mapper-impl:jar
           [exec] > Task :apps:apio-architect:apio-architect-uri-mapper-impl:restoreHotfixVersion
           [exec] 
           [exec] > Task :apps:application-list:application-list-api:compileJava
           [exec] Note: /opt/dev/projects/github/liferay-portal-7.1.x/modules/apps/application-list/application-list-api/src/main/java/com/liferay/application/list/BasePanelApp.java uses or overrides a deprecated API.
           [exec] Note: Recompile with -Xlint:deprecation for details.
           [exec] Note: Some input files use unchecked or unsafe operations.
           [exec] Note: Recompile with -Xlint:unchecked for details.
           [exec] 
           [exec] > Task :apps:announcements:announcements-web:compileJava
           [exec] Note: Some input files use or override a deprecated API.
           [exec] Note: Recompile with -Xlint:deprecation for details.
           [exec] 
           [exec] > Task :apps:apio-architect:apio-architect-api:autoUpdateXml SKIPPED
           [exec] > Task :apps:apio-architect:apio-architect-api:jar
           [exec] > Task :apps:apio-architect:apio-architect-api:restoreHotfixVersion
           [exec] > Task :apps:analytics:analytics-data-binding-impl:autoUpdateXml SKIPPED
           [exec] > Task :apps:analytics:analytics-data-binding-impl:jar
           [exec] > Task :apps:analytics:analytics-data-binding-impl:restoreHotfixVersion
           [exec] 
           [exec] > Task :core:portal-bootstrap:buildSystemPackagesExtraManifest
           [exec] [Export org.aspectj.lang,  has 1,  private references [org.aspectj.runtime.internal], , Export org.springframework.aop.aspectj,  has 1,  private references [org.aspectj.runtime.internal], , Export org.springframework.cache.aspectj,  has 1,  private references [org.aspectj.runtime.internal], , Export org.springframework.cglib.core,  has 1,  private references [org.springframework.cglib.core.internal], , Export org.springframework.mock.staticmock,  has 1,  private references [org.aspectj.runtime.internal], , Export org.springframework.scheduling.aspectj,  has 1,  private references [org.aspectj.runtime.internal], , Export org.springframework.transaction.aspectj,  has 1,  private references [org.aspectj.runtime.internal], ]
           [exec] Building the system.packages.extra.mf file took 25 seconds.
           [exec] 324 actionable tasks: 275 executed, 49 up-to-date
           [exec] Gradle build finished at 2019-03-20 02:11:05.289.
           [exec] 
           [exec] FAILURE: Build failed with an exception.
           [exec] 
           [exec] * What went wrong:
           [exec] Execution failed for task ':apps:apio-architect:apio-architect-impl:compileJava'.
           [exec] > Compilation failed; see the compiler error output for details.
           [exec] 
           [exec] * Try:
           [exec] Run with --info or --debug option to get more log output. Run with --scan to get full insights.
           [exec] 
           [exec] * Exception is:
           [exec] org.gradle.api.tasks.TaskExecutionException: Execution failed for task ':apps:apio-architect:apio-architect-impl:compileJava'.
           [exec] 	at org.gradle.api.internal.tasks.execution.ExecuteActionsTaskExecuter.executeActions(ExecuteActionsTaskExecuter.java:110)
           [exec] 	at org.gradle.api.internal.tasks.execution.ExecuteActionsTaskExecuter.execute(ExecuteActionsTaskExecuter.java:77)
           [exec] 	at org.gradle.api.internal.tasks.execution.OutputDirectoryCreatingTaskExecuter.execute(OutputDirectoryCreatingTaskExecuter.java:51)
           [exec] 	at org.gradle.api.internal.tasks.execution.SkipUpToDateTaskExecuter.execute(SkipUpToDateTaskExecuter.java:59)
           [exec] 	at org.gradle.api.internal.tasks.execution.ResolveTaskOutputCachingStateExecuter.execute(ResolveTaskOutputCachingStateExecuter.java:54)
           [exec] 	at org.gradle.api.internal.tasks.execution.ValidatingTaskExecuter.execute(ValidatingTaskExecuter.java:59)
           [exec] 	at org.gradle.api.internal.tasks.execution.SkipEmptySourceFilesTaskExecuter.execute(SkipEmptySourceFilesTaskExecuter.java:101)
           [exec] 	at org.gradle.api.internal.tasks.execution.FinalizeInputFilePropertiesTaskExecuter.execute(FinalizeInputFilePropertiesTaskExecuter.java:44)
           [exec] 	at org.gradle.api.internal.tasks.execution.CleanupStaleOutputsExecuter.execute(CleanupStaleOutputsExecuter.java:91)
           [exec] 	at org.gradle.api.internal.tasks.execution.ResolveTaskArtifactStateTaskExecuter.execute(ResolveTaskArtifactStateTaskExecuter.java:62)
           [exec] 	at org.gradle.api.internal.tasks.execution.SkipTaskWithNoActionsExecuter.execute(SkipTaskWithNoActionsExecuter.java:59)
           [exec] 	at org.gradle.api.internal.tasks.execution.SkipOnlyIfTaskExecuter.execute(SkipOnlyIfTaskExecuter.java:54)
           [exec] 	at org.gradle.api.internal.tasks.execution.ExecuteAtMostOnceTaskExecuter.execute(ExecuteAtMostOnceTaskExecuter.java:43)
           [exec] 	at org.gradle.api.internal.tasks.execution.CatchExceptionTaskExecuter.execute(CatchExceptionTaskExecuter.java:34)
           [exec] 	at org.gradle.api.internal.tasks.execution.EventFiringTaskExecuter$1.run(EventFiringTaskExecuter.java:51)
           [exec] 	at org.gradle.internal.operations.DefaultBuildOperationExecutor$RunnableBuildOperationWorker.execute(DefaultBuildOperationExecutor.java:300)
           [exec] 	at org.gradle.internal.operations.DefaultBuildOperationExecutor$RunnableBuildOperationWorker.execute(DefaultBuildOperationExecutor.java:292)
           [exec] 	at org.gradle.internal.operations.DefaultBuildOperationExecutor.execute(DefaultBuildOperationExecutor.java:174)
           [exec] 	at org.gradle.internal.operations.DefaultBuildOperationExecutor.run(DefaultBuildOperationExecutor.java:90)
           [exec] 	at org.gradle.internal.operations.DelegatingBuildOperationExecutor.run(DelegatingBuildOperationExecutor.java:31)
           [exec] 	at org.gradle.api.internal.tasks.execution.EventFiringTaskExecuter.execute(EventFiringTaskExecuter.java:46)
           [exec] 	at org.gradle.execution.taskgraph.LocalTaskInfoExecutor.execute(LocalTaskInfoExecutor.java:42)
           [exec] 	at org.gradle.execution.taskgraph.DefaultTaskExecutionGraph$BuildOperationAwareWorkItemExecutor.execute(DefaultTaskExecutionGraph.java:277)
           [exec] 	at org.gradle.execution.taskgraph.DefaultTaskExecutionGraph$BuildOperationAwareWorkItemExecutor.execute(DefaultTaskExecutionGraph.java:262)
           [exec] 	at org.gradle.execution.taskgraph.DefaultTaskPlanExecutor$ExecutorWorker$1.execute(DefaultTaskPlanExecutor.java:135)
           [exec] 	at org.gradle.execution.taskgraph.DefaultTaskPlanExecutor$ExecutorWorker$1.execute(DefaultTaskPlanExecutor.java:130)
           [exec] 	at org.gradle.execution.taskgraph.DefaultTaskPlanExecutor$ExecutorWorker.execute(DefaultTaskPlanExecutor.java:200)
           [exec] 	at org.gradle.execution.taskgraph.DefaultTaskPlanExecutor$ExecutorWorker.executeWithWork(DefaultTaskPlanExecutor.java:191)
           [exec] 	at org.gradle.execution.taskgraph.DefaultTaskPlanExecutor$ExecutorWorker.run(DefaultTaskPlanExecutor.java:130)
           [exec] 	at org.gradle.internal.concurrent.ExecutorPolicy$CatchAndRecordFailures.onExecute(ExecutorPolicy.java:63)
           [exec] 	at org.gradle.internal.concurrent.ManagedExecutorImpl$1.run(ManagedExecutorImpl.java:46)
           [exec] 	at org.gradle.internal.concurrent.ThreadFactoryImpl$ManagedThreadRunnable.run(ThreadFactoryImpl.java:55)
           [exec] Caused by: org.gradle.api.internal.tasks.compile.CompilationFailedException: Compilation failed; see the compiler error output for details.
           [exec] 	at org.gradle.api.internal.tasks.compile.JdkJavaCompiler.execute(JdkJavaCompiler.java:52)
           [exec] 	at org.gradle.api.internal.tasks.compile.JdkJavaCompiler.execute(JdkJavaCompiler.java:36)
           [exec] 	at org.gradle.api.internal.tasks.compile.NormalizingJavaCompiler.delegateAndHandleErrors(NormalizingJavaCompiler.java:100)
           [exec] 	at org.gradle.api.internal.tasks.compile.NormalizingJavaCompiler.execute(NormalizingJavaCompiler.java:52)
           [exec] 	at org.gradle.api.internal.tasks.compile.NormalizingJavaCompiler.execute(NormalizingJavaCompiler.java:38)
           [exec] 	at org.gradle.api.internal.tasks.compile.AnnotationProcessorDiscoveringCompiler.execute(AnnotationProcessorDiscoveringCompiler.java:49)
           [exec] 	at org.gradle.api.internal.tasks.compile.AnnotationProcessorDiscoveringCompiler.execute(AnnotationProcessorDiscoveringCompiler.java:35)
           [exec] 	at org.gradle.api.internal.tasks.compile.CleaningJavaCompilerSupport.execute(CleaningJavaCompilerSupport.java:39)
           [exec] 	at org.gradle.api.internal.tasks.compile.incremental.IncrementalCompilerFactory$2.execute(IncrementalCompilerFactory.java:110)
           [exec] 	at org.gradle.api.internal.tasks.compile.incremental.IncrementalCompilerFactory$2.execute(IncrementalCompilerFactory.java:106)
           [exec] 	at org.gradle.api.internal.tasks.compile.incremental.IncrementalResultStoringCompiler.execute(IncrementalResultStoringCompiler.java:59)
           [exec] 	at org.gradle.api.internal.tasks.compile.incremental.IncrementalResultStoringCompiler.execute(IncrementalResultStoringCompiler.java:43)
           [exec] 	at org.gradle.api.tasks.compile.JavaCompile.performCompilation(JavaCompile.java:153)
           [exec] 	at org.gradle.api.tasks.compile.JavaCompile.compile(JavaCompile.java:121)
           [exec] 	at org.gradle.internal.reflect.JavaMethod.invoke(JavaMethod.java:73)
           [exec] 	at org.gradle.api.internal.project.taskfactory.IncrementalTaskAction.doExecute(IncrementalTaskAction.java:50)
           [exec] 	at org.gradle.api.internal.project.taskfactory.StandardTaskAction.execute(StandardTaskAction.java:39)
           [exec] 	at org.gradle.api.internal.project.taskfactory.StandardTaskAction.execute(StandardTaskAction.java:26)
           [exec] 	at org.gradle.api.internal.tasks.execution.ExecuteActionsTaskExecuter$1.run(ExecuteActionsTaskExecuter.java:131)
           [exec] 	at org.gradle.internal.operations.DefaultBuildOperationExecutor$RunnableBuildOperationWorker.execute(DefaultBuildOperationExecutor.java:300)
           [exec] 	at org.gradle.internal.operations.DefaultBuildOperationExecutor$RunnableBuildOperationWorker.execute(DefaultBuildOperationExecutor.java:292)
           [exec] 	at org.gradle.internal.operations.DefaultBuildOperationExecutor.execute(DefaultBuildOperationExecutor.java:174)
           [exec] 	at org.gradle.internal.operations.DefaultBuildOperationExecutor.run(DefaultBuildOperationExecutor.java:90)
           [exec] 	at org.gradle.internal.operations.DelegatingBuildOperationExecutor.run(DelegatingBuildOperationExecutor.java:31)
           [exec] 	at org.gradle.api.internal.tasks.execution.ExecuteActionsTaskExecuter.executeAction(ExecuteActionsTaskExecuter.java:120)
           [exec] 	at org.gradle.api.internal.tasks.execution.ExecuteActionsTaskExecuter.executeActions(ExecuteActionsTaskExecuter.java:99)
           [exec] 	... 31 more
           [exec] 
           [exec] 
           [exec] * Get more help at https://help.gradle.org
           [exec] 
           [exec] BUILD FAILED in 1m 51s
      

        Attachments

          Activity

            People

            • Assignee:
              yvonne.han Yvonne Han
              Reporter:
              yvonne.han Yvonne Han
              Participants of an Issue:
              Recent user:
              Yvonne Han
            • Votes:
              0 Vote for this issue
              Watchers:
              2 Start watching this issue

              Dates

              • Created:
                Updated:
                Resolved:
                Days since last comment:
                8 weeks, 5 days ago