Uploaded image for project: 'PUBLIC - Liferay Portal Community Edition'
  1. PUBLIC - Liferay Portal Community Edition
  2. LPS-92521

Calendar integration test failed due to cannot find symbol

    Details

    • Type: Regression Bug
    • Status: Closed
    • Resolution: No Longer Reproducible
    • Affects Version/s: 7.0.X
    • Fix Version/s: None
    • Component/s: Calendar
    • Labels:
      None
    • Branch Version/s:
      7.0.x
    • Fix Priority:
      4
    • Sprint:
      Workflow_7.2_09

      Description

      We caught the following error from CI tester under target modules-integration-mysql56-jdk8 on 7.0.x.

      Error message:

      [exec] 07:53:17,565 INFO  [elasticsearch[Midas][clusterService#updateTask][T#1]][metadata:317] [Midas] [liferay-20115] update_mapping [LiferayDocumentType]
           [exec] /opt/dev/projects/github/liferay-portal-7.0.x/modules/apps/forms-and-workflow/calendar/calendar-test/src/testIntegration/java/com/liferay/calendar/test/util/CalendarUpgradeTestUtil.java:31: error: cannot find symbol
           [exec] 		return registry.callService(
           [exec] 		               ^
           [exec]   symbol:   method callService(String,(UpgradeSt[...](); })
           [exec]   location: variable registry of type Registry
           [exec] 1 error
           [exec] 
           [exec] FAILURE: Build failed with an exception.
           [exec] 
           [exec] * What went wrong:
           [exec] Execution failed for task ':apps:forms-and-workflow:calendar:calendar-test:compileTestIntegrationJava'.
           [exec] > Compilation failed; see the compiler error output for details.
           [exec] 
           [exec] * Try:
           [exec] Run with --info or --debug option to get more log output. Run with --scan to get full insights.
           [exec] 
           [exec] * Exception is:
           [exec] org.gradle.api.tasks.TaskExecutionException: Execution failed for task ':apps:forms-and-workflow:calendar:calendar-test:compileTestIntegrationJava'.
           [exec] 	at org.gradle.api.internal.tasks.execution.ExecuteActionsTaskExecuter.executeActions(ExecuteActionsTaskExecuter.java:110)
      

      You can find the details error message here.

        Attachments

          Issue Links

            Activity

              People

              Assignee:
              manoel.cyreno Manoel Cyreno
              Reporter:
              joyce.wang Joyce Wang
              Participants of an Issue:
              Recent user:
              Manoel Cyreno
              Votes:
              0 Vote for this issue
              Watchers:
              0 Start watching this issue

                Dates

                Created:
                Updated:
                Resolved:
                Days since last comment:
                1 year, 30 weeks ago

                  Packages

                  Version Package