Details

      Description

      Portal fails to build when it gets to the Sharepoint REST module.

      [exec] 
           [exec] Using proxy squid.lax.liferay.com:3128.
           [exec] Parallel execution with configuration on demand is an incubating feature.
           [echo] Generating Jenkins report.
           [echo] Rsyncing Jenkins report.
         [delete] Deleting: /opt/dev/projects/github/liferay-jenkins-ee/commands/20190430070955088
           [exec] 
           [exec] > Configure project :apps:bulk:bulk-rest-impl
           [exec] Unable to find /opt/dev/projects/github/liferay-portal/tools/sdk/dependencies/com.liferay.portal.tools.rest.builder/lib, using default version of com.liferay.portal.tools.rest.builder
           [exec] 
           [exec] > Configure project :apps:data-engine:data-engine-rest-impl
           [exec] Unable to find /opt/dev/projects/github/liferay-portal/tools/sdk/dependencies/com.liferay.portal.tools.rest.builder/lib, using default version of com.liferay.portal.tools.rest.builder
           [exec] 
           [exec] > Configure project :apps:headless:headless-admin-taxonomy:headless-admin-taxonomy-impl
           [exec] Unable to find /opt/dev/projects/github/liferay-portal/tools/sdk/dependencies/com.liferay.portal.tools.rest.builder/lib, using default version of com.liferay.portal.tools.rest.builder
           [exec] 
           [exec] > Configure project :apps:headless:headless-admin-user:headless-admin-user-impl
           [exec] Unable to find /opt/dev/projects/github/liferay-portal/tools/sdk/dependencies/com.liferay.portal.tools.rest.builder/lib, using default version of com.liferay.portal.tools.rest.builder
           [exec] 
           [exec] > Configure project :apps:headless:headless-admin-workflow:headless-admin-workflow-impl
           [exec] Unable to find /opt/dev/projects/github/liferay-portal/tools/sdk/dependencies/com.liferay.portal.tools.rest.builder/lib, using default version of com.liferay.portal.tools.rest.builder
           [exec] 
           [exec] > Configure project :apps:headless:headless-delivery:headless-delivery-impl
           [exec] Unable to find /opt/dev/projects/github/liferay-portal/tools/sdk/dependencies/com.liferay.portal.tools.rest.builder/lib, using default version of com.liferay.portal.tools.rest.builder
           [exec] 
           [exec] > Configure project :apps:headless:headless-form:headless-form-impl
           [exec] Unable to find /opt/dev/projects/github/liferay-portal/tools/sdk/dependencies/com.liferay.portal.tools.rest.builder/lib, using default version of com.liferay.portal.tools.rest.builder
           [exec] 
           [exec] > Configure project :private:apps:portal-workflow:portal-workflow-metrics-rest-impl
           [exec] Unable to find /opt/dev/projects/github/liferay-portal/tools/sdk/dependencies/com.liferay.portal.tools.rest.builder/lib, using default version of com.liferay.portal.tools.rest.builder
           [exec] 
           [exec] FAILURE: Build failed with an exception.
           [exec] 
           [exec] * Where:
           [exec] Build file '/opt/dev/projects/github/liferay-portal/modules/private/apps/sharepoint-rest/sharepoint-rest-oauth2-test/build.gradle' line: 4
           [exec] 
           [exec] * What went wrong:
           [exec] A problem occurred evaluating project ':private:apps:sharepoint-rest:sharepoint-rest-oauth2-test'.
           [exec] > Could not find method testIntegrationCompiletestIntegrationCompile() for arguments [project ':test:arquillian-extension-junit-bridge'] on object of type org.gradle.api.internal.artifacts.dsl.dependencies.DefaultDependencyHandler.
           [exec] 
           [exec] * Try:
           [exec] Run with --info or --debug option to get more log output. Run with --scan to get full insights.
           [exec] 
           [exec] * Exception is:
           [exec] org.gradle.api.GradleScriptException: A problem occurred evaluating project ':private:apps:sharepoint-rest:sharepoint-rest-oauth2-test'.
           [exec] 	at org.gradle.groovy.scripts.internal.DefaultScriptRunnerFactory$ScriptRunnerImpl.run(DefaultScriptRunnerFactory.java:92)
           [exec] 	at org.gradle.configuration.DefaultScriptPluginFactory$ScriptPluginImpl$2.run(DefaultScriptPluginFactory.java:206)
           [exec] 	at org.gradle.configuration.ProjectScriptTarget.addConfiguration(ProjectScriptTarget.java:77)
           [exec] 	at org.gradle.configuration.DefaultScriptPluginFactory$ScriptPluginImpl.apply(DefaultScriptPluginFactory.java:211)
           [exec] 	at org.gradle.configuration.BuildOperationScriptPlugin$1$1.run(BuildOperationScriptPlugin.java:69)
           [exec] 	at org.gradle.internal.operations.DefaultBuildOperationExecutor$RunnableBuildOperationWorker.execute(DefaultBuildOperationExecutor.java:300)
           [exec] 	at org.gradle.internal.operations.DefaultBuildOperationExecutor$RunnableBuildOperationWorker.execute(DefaultBuildOperationExecutor.java:292)
           [exec] 	at org.gradle.internal.operations.DefaultBuildOperationExecutor.execute(DefaultBuildOperationExecutor.java:174)
           [exec] 	at org.gradle.internal.operations.DefaultBuildOperationExecutor.run(DefaultBuildOperationExecutor.java:90)
           [exec] 	at org.gradle.internal.operations.DelegatingBuildOperationExecutor.run(DelegatingBuildOperationExecutor.java:31)
           [exec] 	at org.gradle.configuration.BuildOperationScriptPlugin$1.execute(BuildOperationScriptPlugin.java:66)
           [exec] 	at org.gradle.configuration.BuildOperationScriptPlugin$1.execute(BuildOperationScriptPlugin.java:63)
           [exec] 	at org.gradle.configuration.internal.DefaultUserCodeApplicationContext.apply(DefaultUserCodeApplicationContext.java:48)
           [exec] 	at org.gradle.configuration.BuildOperationScriptPlugin.apply(BuildOperationScriptPlugin.java:63)
           [exec] 	at org.gradle.configuration.project.BuildScriptProcessor.execute(BuildScriptProcessor.java:41)
           [exec] 	at org.gradle.configuration.project.BuildScriptProcessor.execute(BuildScriptProcessor.java:26)
           [exec] 	at org.gradle.configuration.project.ConfigureActionsProjectEvaluator.evaluate(ConfigureActionsProjectEvaluator.java:34)
           [exec] 	at org.gradle.configuration.project.LifecycleProjectEvaluator$EvaluateProject.run(LifecycleProjectEvaluator.java:105)
           [exec] 	at org.gradle.internal.operations.DefaultBuildOperationExecutor$RunnableBuildOperationWorker.execute(DefaultBuildOperationExecutor.java:300)
           [exec] 	at org.gradle.internal.operations.DefaultBuildOperationExecutor$RunnableBuildOperationWorker.execute(DefaultBuildOperationExecutor.java:292)
           [exec] 	at org.gradle.internal.operations.DefaultBuildOperationExecutor.execute(DefaultBuildOperationExecutor.java:174)
           [exec] 	at org.gradle.internal.operations.DefaultBuildOperationExecutor.run(DefaultBuildOperationExecutor.java:90)
           [exec] 	at org.gradle.internal.operations.DelegatingBuildOperationExecutor.run(DelegatingBuildOperationExecutor.java:31)
           [exec] 	at org.gradle.configuration.project.LifecycleProjectEvaluator.evaluate(LifecycleProjectEvaluator.java:68)
           [exec] 	at org.gradle.api.internal.project.DefaultProject.evaluate(DefaultProject.java:687)
           [exec] 	at org.gradle.api.internal.project.DefaultProject.evaluate(DefaultProject.java:140)
           [exec] 	at org.gradle.execution.TaskPathProjectEvaluator.configure(TaskPathProjectEvaluator.java:35)
           [exec] 	at org.gradle.execution.TaskPathProjectEvaluator.configureHierarchy(TaskPathProjectEvaluator.java:62)
           [exec] 	at org.gradle.execution.TaskSelector.getSelection(TaskSelector.java:100)
           [exec] 	at org.gradle.execution.TaskSelector.getSelection(TaskSelector.java:81)
           [exec] 	at org.gradle.execution.commandline.CommandLineTaskParser.parseTasks(CommandLineTaskParser.java:42)
           [exec] 	at org.gradle.execution.TaskNameResolvingBuildConfigurationAction.configure(TaskNameResolvingBuildConfigurationAction.java:44)
           [exec] 	at org.gradle.execution.DefaultBuildConfigurationActionExecuter.configure(DefaultBuildConfigurationActionExecuter.java:48)
           [exec] 	at org.gradle.execution.DefaultBuildConfigurationActionExecuter.access$000(DefaultBuildConfigurationActionExecuter.java:25)
           [exec] 	at org.gradle.execution.DefaultBuildConfigurationActionExecuter$1.proceed(DefaultBuildConfigurationActionExecuter.java:54)
           [exec] 	at org.gradle.execution.DefaultTasksBuildExecutionAction.configure(DefaultTasksBuildExecutionAction.java:44)
           [exec] 	at org.gradle.execution.DefaultBuildConfigurationActionExecuter.configure(DefaultBuildConfigurationActionExecuter.java:48)
           [exec] 	at org.gradle.execution.DefaultBuildConfigurationActionExecuter.access$000(DefaultBuildConfigurationActionExecuter.java:25)
           [exec] 	at org.gradle.execution.DefaultBuildConfigurationActionExecuter$1.proceed(DefaultBuildConfigurationActionExecuter.java:54)
           [exec] 	at org.gradle.execution.ExcludedTaskFilteringBuildConfigurationAction.configure(ExcludedTaskFilteringBuildConfigurationAction.java:47)
           [exec] 	at org.gradle.execution.DefaultBuildConfigurationActionExecuter.configure(DefaultBuildConfigurationActionExecuter.java:48)
           [exec] 	at org.gradle.execution.DefaultBuildConfigurationActionExecuter.select(DefaultBuildConfigurationActionExecuter.java:36)
           [exec] 	at org.gradle.initialization.DefaultGradleLauncher$CalculateTaskGraph.run(DefaultGradleLauncher.java:305)
           [exec] 	at org.gradle.internal.operations.DefaultBuildOperationExecutor$RunnableBuildOperationWorker.execute(DefaultBuildOperationExecutor.java:300)
           [exec] 	at org.gradle.internal.operations.DefaultBuildOperationExecutor$RunnableBuildOperationWorker.execute(DefaultBuildOperationExecutor.java:292)
           [exec] 	at org.gradle.internal.operations.DefaultBuildOperationExecutor.execute(DefaultBuildOperationExecutor.java:174)
           [exec] 	at org.gradle.internal.operations.DefaultBuildOperationExecutor.run(DefaultBuildOperationExecutor.java:90)
           [exec] 	at org.gradle.internal.operations.DelegatingBuildOperationExecutor.run(DelegatingBuildOperationExecutor.java:31)
           [exec] 	at org.gradle.initialization.DefaultGradleLauncher.constructTaskGraph(DefaultGradleLauncher.java:190)
           [exec] 	at org.gradle.initialization.DefaultGradleLauncher.doBuildStages(DefaultGradleLauncher.java:145)
           [exec] 	at org.gradle.initialization.DefaultGradleLauncher.executeTasks(DefaultGradleLauncher.java:124)
           [exec] 	at org.gradle.internal.invocation.GradleBuildController$1.call(GradleBuildController.java:77)
           [exec] 	at org.gradle.internal.invocation.GradleBuildController$1.call(GradleBuildController.java:74)
           [exec] 	at org.gradle.internal.work.DefaultWorkerLeaseService.withLocks(DefaultWorkerLeaseService.java:154)
           [exec] 	at org.gradle.internal.work.StopShieldingWorkerLeaseService.withLocks(StopShieldingWorkerLeaseService.java:38)
           [exec] 	at org.gradle.internal.invocation.GradleBuildController.doBuild(GradleBuildController.java:96)
           [exec] 	at org.gradle.internal.invocation.GradleBuildController.run(GradleBuildController.java:74)
           [exec] 	at org.gradle.tooling.internal.provider.ExecuteBuildActionRunner.run(ExecuteBuildActionRunner.java:28)
           [exec] 	at org.gradle.launcher.exec.ChainingBuildActionRunner.run(ChainingBuildActionRunner.java:35)
           [exec] 	at org.gradle.tooling.internal.provider.ValidatingBuildActionRunner.run(ValidatingBuildActionRunner.java:32)
           [exec] 	at org.gradle.launcher.exec.RunAsBuildOperationBuildActionRunner$3.run(RunAsBuildOperationBuildActionRunner.java:50)
           [exec] 	at org.gradle.internal.operations.DefaultBuildOperationExecutor$RunnableBuildOperationWorker.execute(DefaultBuildOperationExecutor.java:300)
           [exec] 	at org.gradle.internal.operations.DefaultBuildOperationExecutor$RunnableBuildOperationWorker.execute(DefaultBuildOperationExecutor.java:292)
           [exec] 	at org.gradle.internal.operations.DefaultBuildOperationExecutor.execute(DefaultBuildOperationExecutor.java:174)
           [exec] 	at org.gradle.internal.operations.DefaultBuildOperationExecutor.run(DefaultBuildOperationExecutor.java:90)
           [exec] 	at org.gradle.internal.operations.DelegatingBuildOperationExecutor.run(DelegatingBuildOperationExecutor.java:31)
           [exec] 	at org.gradle.launcher.exec.RunAsBuildOperationBuildActionRunner.run(RunAsBuildOperationBuildActionRunner.java:45)
           [exec] 	at org.gradle.tooling.internal.provider.SubscribableBuildActionRunner.run(SubscribableBuildActionRunner.java:51)
           [exec] 	at org.gradle.launcher.exec.InProcessBuildActionExecuter$1.transform(InProcessBuildActionExecuter.java:47)
           [exec] 	at org.gradle.launcher.exec.InProcessBuildActionExecuter$1.transform(InProcessBuildActionExecuter.java:44)
           [exec] 	at org.gradle.composite.internal.DefaultRootBuildState.run(DefaultRootBuildState.java:79)
           [exec] 	at org.gradle.launcher.exec.InProcessBuildActionExecuter.execute(InProcessBuildActionExecuter.java:44)
           [exec] 	at org.gradle.launcher.exec.InProcessBuildActionExecuter.execute(InProcessBuildActionExecuter.java:30)
           [exec] 	at org.gradle.launcher.exec.BuildTreeScopeBuildActionExecuter.execute(BuildTreeScopeBuildActionExecuter.java:39)
           [exec] 	at org.gradle.launcher.exec.BuildTreeScopeBuildActionExecuter.execute(BuildTreeScopeBuildActionExecuter.java:25)
           [exec] 	at org.gradle.tooling.internal.provider.ContinuousBuildActionExecuter.execute(ContinuousBuildActionExecuter.java:80)
           [exec] 	at org.gradle.tooling.internal.provider.ContinuousBuildActionExecuter.execute(ContinuousBuildActionExecuter.java:53)
           [exec] 	at org.gradle.tooling.internal.provider.ServicesSetupBuildActionExecuter.execute(ServicesSetupBuildActionExecuter.java:62)
           [exec] 	at org.gradle.tooling.internal.provider.ServicesSetupBuildActionExecuter.execute(ServicesSetupBuildActionExecuter.java:34)
           [exec] 	at org.gradle.tooling.internal.provider.GradleThreadBuildActionExecuter.execute(GradleThreadBuildActionExecuter.java:36)
           [exec] 	at org.gradle.tooling.internal.provider.GradleThreadBuildActionExecuter.execute(GradleThreadBuildActionExecuter.java:25)
           [exec] 	at org.gradle.tooling.internal.provider.ParallelismConfigurationBuildActionExecuter.execute(ParallelismConfigurationBuildActionExecuter.java:43)
           [exec] 	at org.gradle.tooling.internal.provider.ParallelismConfigurationBuildActionExecuter.execute(ParallelismConfigurationBuildActionExecuter.java:29)
           [exec] 	at org.gradle.tooling.internal.provider.StartParamsValidatingActionExecuter.execute(StartParamsValidatingActionExecuter.java:59)
           [exec] 	at org.gradle.tooling.internal.provider.StartParamsValidatingActionExecuter.execute(StartParamsValidatingActionExecuter.java:31)
           [exec] 	at org.gradle.tooling.internal.provider.SessionFailureReportingActionExecuter.execute(SessionFailureReportingActionExecuter.java:59)
           [exec] 	at org.gradle.tooling.internal.provider.SessionFailureReportingActionExecuter.execute(SessionFailureReportingActionExecuter.java:44)
           [exec] 	at org.gradle.tooling.internal.provider.SetupLoggingActionExecuter.execute(SetupLoggingActionExecuter.java:46)
           [exec] 	at org.gradle.tooling.internal.provider.SetupLoggingActionExecuter.execute(SetupLoggingActionExecuter.java:30)
           [exec] 	at org.gradle.launcher.cli.RunBuildAction.run(RunBuildAction.java:52)
           [exec] 	at org.gradle.internal.Actions$RunnableActionAdapter.execute(Actions.java:207)
           [exec] 	at org.gradle.launcher.cli.CommandLineActionFactory$ParseAndBuildAction.execute(CommandLineActionFactory.java:402)
           [exec] 	at org.gradle.launcher.cli.CommandLineActionFactory$ParseAndBuildAction.execute(CommandLineActionFactory.java:375)
           [exec] 	at org.gradle.launcher.cli.ExceptionReportingAction.execute(ExceptionReportingAction.java:37)
           [exec] 	at org.gradle.launcher.cli.ExceptionReportingAction.execute(ExceptionReportingAction.java:23)
           [exec] 	at org.gradle.launcher.cli.CommandLineActionFactory$WithLogging.execute(CommandLineActionFactory.java:368)
           [exec] 	at org.gradle.launcher.cli.CommandLineActionFactory$WithLogging.execute(CommandLineActionFactory.java:298)
           [exec] 	at org.gradle.launcher.Main.doAction(Main.java:36)
           [exec] 	at org.gradle.launcher.bootstrap.EntryPoint.run(EntryPoint.java:45)
           [exec] 	at org.gradle.launcher.bootstrap.ProcessBootstrap.runNoExit(ProcessBootstrap.java:60)
           [exec] 	at org.gradle.launcher.bootstrap.ProcessBootstrap.run(ProcessBootstrap.java:37)
           [exec] 	at org.gradle.launcher.GradleMain.main(GradleMain.java:23)
           [exec] 	at org.gradle.wrapper.BootstrapMainStarter.start(BootstrapMainStarter.java:31)
           [exec] 	at org.gradle.wrapper.WrapperExecutor.execute(WrapperExecutor.java:108)
           [exec] 	at org.gradle.wrapper.GradleWrapperMain.main(GradleWrapperMain.java:61)
           [exec] Caused by: org.gradle.internal.metaobject.AbstractDynamicObject$CustomMessageMissingMethodException: Could not find method testIntegrationCompiletestIntegrationCompile() for arguments [project ':test:arquillian-extension-junit-bridge'] on object of type org.gradle.api.internal.artifacts.dsl.dependencies.DefaultDependencyHandler.
           [exec] 	at org.gradle.internal.metaobject.AbstractDynamicObject.methodMissingException(AbstractDynamicObject.java:179)
           [exec] 	at org.gradle.internal.metaobject.ConfigureDelegate.invokeMethod(ConfigureDelegate.java:87)
           [exec] 	at build_83datd3ajdov0md3ng1qc63o1$_run_closure1.doCall(/opt/dev/projects/github/liferay-portal/modules/private/apps/sharepoint-rest/sharepoint-rest-oauth2-test/build.gradle:4)
           [exec] 	at org.gradle.api.internal.ClosureBackedAction.execute(ClosureBackedAction.java:71)
           [exec] 	at org.gradle.util.ConfigureUtil.configureTarget(ConfigureUtil.java:155)
           [exec] 	at org.gradle.util.ConfigureUtil.configure(ConfigureUtil.java:106)
           [exec] 	at org.gradle.api.internal.project.DefaultProject.dependencies(DefaultProject.java:1187)
           [exec] 	at org.gradle.internal.metaobject.BeanDynamicObject$MetaClassAdapter.invokeMethod(BeanDynamicObject.java:479)
           [exec] 	at org.gradle.internal.metaobject.BeanDynamicObject.tryInvokeMethod(BeanDynamicObject.java:191)
           [exec] 	at org.gradle.internal.metaobject.CompositeDynamicObject.tryInvokeMethod(CompositeDynamicObject.java:98)
           [exec] 	at org.gradle.internal.metaobject.MixInClosurePropertiesAsMethodsDynamicObject.tryInvokeMethod(MixInClosurePropertiesAsMethodsDynamicObject.java:30)
           [exec] 	at org.gradle.groovy.scripts.BasicScript$ScriptDynamicObject.tryInvokeMethod(BasicScript.java:133)
           [exec] 	at org.gradle.internal.metaobject.AbstractDynamicObject.invokeMethod(AbstractDynamicObject.java:160)
           [exec] 	at org.gradle.groovy.scripts.BasicScript.invokeMethod(BasicScript.java:82)
           [exec] 	at build_83datd3ajdov0md3ng1qc63o1.run(/opt/dev/projects/github/liferay-portal/modules/private/apps/sharepoint-rest/sharepoint-rest-oauth2-test/build.gradle:1)
           [exec] 	at org.gradle.groovy.scripts.internal.DefaultScriptRunnerFactory$ScriptRunnerImpl.run(DefaultScriptRunnerFactory.java:90)
           [exec] 	... 104 more
           [exec] 
           [exec] 
           [exec] * Get more help at https://help.gradle.org
           [exec] 
           [exec] BUILD FAILED in 1m 8s
           [exec] Gradle build finished at 2019-04-30 07:10:52.309.
           [exec] 
      

      Full log here

      Suspicious commit: https://github.com/liferay/liferay-portal-ee/commit/fb032b3c5770f433ea6658d019e5570d89e1d3b3#diff-6f1762a64bbafe8ad134c93bc8fca57f

        Attachments

          Issue Links

            Activity

              People

              Assignee:
              brian.chan Brian Chan
              Reporter:
              austin.chiang Austin Chiang
              Participants of an Issue:
              Recent user:
              Tomáš Polešovský
              Votes:
              0 Vote for this issue
              Watchers:
              0 Start watching this issue

                Dates

                Created:
                Updated:
                Resolved:
                Days since last comment:
                2 years, 7 weeks, 2 days ago

                  Packages

                  Version Package