Details

    • Type: Regression Bug
    • Status: Closed
    • Resolution: No Longer Reproducible
    • Affects Version/s: 7.2.X, Master
    • Fix Version/s: None
    • Labels:

      Description

      SF errors have rebounded in source-format-jdk8/0 test

           [exec] > Task :yarnCheckFormatModules
           [exec] yarn run v1.13.0
           [exec] $ liferay-npm-scripts check --production false
           [exec] apps/layout/layout-content-page-editor-web/src/main/resources/META-INF/resources/js/components/sidebar/comments/AddCommentForm.es.js: BAD
           [exec] apps/layout/layout-content-page-editor-web/src/main/resources/META-INF/resources/js/components/sidebar/comments/FragmentComments.es.js: BAD
           [exec] Prettier checked 1460 files, found 2 files with problems
           [exec] 
           [exec] ESLint checked 561 files, found 0 errors, found 0 warnings
           [exec] 1 of 2 jobs failed
           [exec] error Command failed with exit code 1.
           [exec] info Visit https://yarnpkg.com/en/docs/cli/run for documentation about this command.
           [exec] 
           [exec] > Task :yarnCheckFormatModules FAILED
           [exec] 2 actionable tasks: 2 executed
           [exec] Gradle build finished at 2019-07-16 21:03:40.884.
           [exec] 
           [exec] See the profiling report at: file:///opt/dev/projects/github/liferay-portal/build/reports/profile/profile-2019-07-16-21-03-10.html
           [exec] A fine-grained performance profile is available: use the --scan option.
           [exec] 
           [exec] FAILURE: Build failed with an exception.
           [exec] 
           [exec] * What went wrong:
           [exec] Execution failed for task ':yarnCheckFormatModules'.
           [exec] > java.io.IOException: Process '[/opt/dev/projects/github/liferay-portal/build/node/bin/node, /opt/dev/projects/github/liferay-portal/modules/yarn-1.13.0.js, checkFormat, --production, false]' finished with non-zero exit value 1
           [exec] 
           [exec] * Try:
           [exec] Run with --info or --debug option to get more log output. Run with --scan to get full insights.
           [exec] 
           [exec] * Exception is:
           [exec] org.gradle.api.tasks.TaskExecutionException: Execution failed for task ':yarnCheckFormatModules'.
           [exec] 	at org.gradle.api.internal.tasks.execution.ExecuteActionsTaskExecuter.executeActions(ExecuteActionsTaskExecuter.java:110)
           [exec] 	at org.gradle.api.internal.tasks.execution.ExecuteActionsTaskExecuter.execute(ExecuteActionsTaskExecuter.java:77)
           [exec] 	at org.gradle.api.internal.tasks.execution.OutputDirectoryCreatingTaskExecuter.execute(OutputDirectoryCreatingTaskExecuter.java:51)
           [exec] 	at org.gradle.api.internal.tasks.execution.SkipUpToDateTaskExecuter.execute(SkipUpToDateTaskExecuter.java:59)
           [exec] 	at org.gradle.api.internal.tasks.execution.ResolveTaskOutputCachingStateExecuter.execute(ResolveTaskOutputCachingStateExecuter.java:54)
           [exec] 	at org.gradle.api.internal.tasks.execution.ValidatingTaskExecuter.execute(ValidatingTaskExecuter.java:59)
           [exec] 	at org.gradle.api.internal.tasks.execution.SkipEmptySourceFilesTaskExecuter.execute(SkipEmptySourceFilesTaskExecuter.java:101)
           [exec] 	at org.gradle.api.internal.tasks.execution.FinalizeInputFilePropertiesTaskExecuter.execute(FinalizeInputFilePropertiesTaskExecuter.java:44)
           [exec] 	at org.gradle.api.internal.tasks.execution.CleanupStaleOutputsExecuter.execute(CleanupStaleOutputsExecuter.java:91)
           [exec] 	at org.gradle.api.internal.tasks.execution.ResolveTaskArtifactStateTaskExecuter.execute(ResolveTaskArtifactStateTaskExecuter.java:62)
           [exec] 	at org.gradle.api.internal.tasks.execution.SkipTaskWithNoActionsExecuter.execute(SkipTaskWithNoActionsExecuter.java:59)
           [exec] 	at org.gradle.api.internal.tasks.execution.SkipOnlyIfTaskExecuter.execute(SkipOnlyIfTaskExecuter.java:54)
           [exec] 	at org.gradle.api.internal.tasks.execution.ExecuteAtMostOnceTaskExecuter.execute(ExecuteAtMostOnceTaskExecuter.java:43)
           [exec] 	at org.gradle.api.internal.tasks.execution.CatchExceptionTaskExecuter.execute(CatchExceptionTaskExecuter.java:34)
           [exec] 	at org.gradle.api.internal.tasks.execution.EventFiringTaskExecuter$1.run(EventFiringTaskExecuter.java:51)
           [exec] 	at org.gradle.internal.operations.DefaultBuildOperationExecutor$RunnableBuildOperationWorker.execute(DefaultBuildOperationExecutor.java:300)
           [exec] 	at org.gradle.internal.operations.DefaultBuildOperationExecutor$RunnableBuildOperationWorker.execute(DefaultBuildOperationExecutor.java:292)
           [exec] 	at org.gradle.internal.operations.DefaultBuildOperationExecutor.execute(DefaultBuildOperationExecutor.java:174)
           [exec] 	at org.gradle.internal.operations.DefaultBuildOperationExecutor.run(DefaultBuildOperationExecutor.java:90)
           [exec] 	at org.gradle.internal.operations.DelegatingBuildOperationExecutor.run(DelegatingBuildOperationExecutor.java:31)
           [exec] 	at org.gradle.api.internal.tasks.execution.EventFiringTaskExecuter.execute(EventFiringTaskExecuter.java:46)
           [exec] 	at org.gradle.execution.taskgraph.LocalTaskInfoExecutor.execute(LocalTaskInfoExecutor.java:42)
           [exec] 	at org.gradle.execution.taskgraph.DefaultTaskExecutionGraph$BuildOperationAwareWorkItemExecutor.execute(DefaultTaskExecutionGraph.java:277)
           [exec] 	at org.gradle.execution.taskgraph.DefaultTaskExecutionGraph$BuildOperationAwareWorkItemExecutor.execute(DefaultTaskExecutionGraph.java:262)
           [exec] 	at org.gradle.execution.taskgraph.DefaultTaskPlanExecutor$ExecutorWorker$1.execute(DefaultTaskPlanExecutor.java:135)
           [exec] 	at org.gradle.execution.taskgraph.DefaultTaskPlanExecutor$ExecutorWorker$1.execute(DefaultTaskPlanExecutor.java:130)
           [exec] 	at org.gradle.execution.taskgraph.DefaultTaskPlanExecutor$ExecutorWorker.execute(DefaultTaskPlanExecutor.java:200)
           [exec] 	at org.gradle.execution.taskgraph.DefaultTaskPlanExecutor$ExecutorWorker.executeWithWork(DefaultTaskPlanExecutor.java:191)
           [exec] 	at org.gradle.execution.taskgraph.DefaultTaskPlanExecutor$ExecutorWorker.run(DefaultTaskPlanExecutor.java:130)
           [exec] 	at org.gradle.internal.concurrent.ExecutorPolicy$CatchAndRecordFailures.onExecute(ExecutorPolicy.java:63)
           [exec] 	at org.gradle.internal.concurrent.ManagedExecutorImpl$1.run(ManagedExecutorImpl.java:46)
           [exec] 	at org.gradle.internal.concurrent.ThreadFactoryImpl$ManagedThreadRunnable.run(ThreadFactoryImpl.java:55)
           [exec] Caused by: org.gradle.api.UncheckedIOException: java.io.IOException: Process '[/opt/dev/projects/github/liferay-portal/build/node/bin/node, /opt/dev/projects/github/liferay-portal/modules/yarn-1.13.0.js, checkFormat, --production, false]' finished with non-zero exit value 1
           [exec] 	at org.gradle.internal.UncheckedException.throwAsUncheckedException(UncheckedException.java:57)
           [exec] 	at org.gradle.internal.UncheckedException.throwAsUncheckedException(UncheckedException.java:40)
           [exec] 	at org.gradle.internal.reflect.JavaMethod.invoke(JavaMethod.java:76)
           [exec] 	at org.gradle.api.internal.project.taskfactory.StandardTaskAction.doExecute(StandardTaskAction.java:46)
           [exec] 	at org.gradle.api.internal.project.taskfactory.StandardTaskAction.execute(StandardTaskAction.java:39)
           [exec] 	at org.gradle.api.internal.project.taskfactory.StandardTaskAction.execute(StandardTaskAction.java:26)
           [exec] 	at org.gradle.api.internal.AbstractTask$TaskActionWrapper.execute(AbstractTask.java:801)
           [exec] 	at org.gradle.api.internal.AbstractTask$TaskActionWrapper.execute(AbstractTask.java:768)
           [exec] 	at org.gradle.api.internal.tasks.execution.ExecuteActionsTaskExecuter$1.run(ExecuteActionsTaskExecuter.java:131)
           [exec] 	at org.gradle.internal.operations.DefaultBuildOperationExecutor$RunnableBuildOperationWorker.execute(DefaultBuildOperationExecutor.java:300)
           [exec] 	at org.gradle.internal.operations.DefaultBuildOperationExecutor$RunnableBuildOperationWorker.execute(DefaultBuildOperationExecutor.java:292)
           [exec] 	at org.gradle.internal.operations.DefaultBuildOperationExecutor.execute(DefaultBuildOperationExecutor.java:174)
           [exec] 	at org.gradle.internal.operations.DefaultBuildOperationExecutor.run(DefaultBuildOperationExecutor.java:90)
           [exec] 	at org.gradle.internal.operations.DelegatingBuildOperationExecutor.run(DelegatingBuildOperationExecutor.java:31)
           [exec] 	at org.gradle.api.internal.tasks.execution.ExecuteActionsTaskExecuter.executeAction(ExecuteActionsTaskExecuter.java:120)
           [exec] 	at org.gradle.api.internal.tasks.execution.ExecuteActionsTaskExecuter.executeActions(ExecuteActionsTaskExecuter.java:99)
           [exec] 	... 31 more
           [exec] Caused by: java.io.IOException: Process '[/opt/dev/projects/github/liferay-portal/build/node/bin/node, /opt/dev/projects/github/liferay-portal/modules/yarn-1.13.0.js, checkFormat, --production, false]' finished with non-zero exit value 1
           [exec] 	at com.liferay.gradle.plugins.node.internal.NodeExecutor._executeProcessBuilder(NodeExecutor.java:216)
           [exec] 	at com.liferay.gradle.plugins.node.internal.NodeExecutor.execute(NodeExecutor.java:89)
           [exec] 	at com.liferay.gradle.plugins.node.tasks.ExecuteNodeTask.executeNode(ExecuteNodeTask.java:77)
           [exec] 	at com.liferay.gradle.plugins.node.tasks.ExecuteNodeScriptTask.executeNode(ExecuteNodeScriptTask.java:40)
           [exec] 	at com.liferay.gradle.plugins.node.tasks.ExecuteNpmTask.executeNode(ExecuteNpmTask.java:108)
           [exec] 	at org.gradle.internal.reflect.JavaMethod.invoke(JavaMethod.java:73)
           [exec] 	... 44 more
           [exec] 
           [exec] 
           [exec] * Get more help at https://help.gradle.org
           [exec] 
           [exec] BUILD FAILED in 31s
      

        Attachments

          Issue Links

            Activity

              People

              • Votes:
                0 Vote for this issue
                Watchers:
                0 Start watching this issue

                Dates

                • Created:
                  Updated:
                  Resolved:
                  Days since last comment:
                  14 weeks, 6 days ago

                  Packages

                  Version Package