Uploaded image for project: 'PUBLIC - Liferay Portal Community Edition'
  1. PUBLIC - Liferay Portal Community Edition
  2. LPS-99302

User-associated-data-test-util failure in modules semantic versioning

    Details

      Description

           [exec] > Task :apps:user-associated-data:user-associated-data-test-util:baseline FAILED
           [exec] [Baseline Warning] Bundle Version Change Recommended: 5.2.0
           [exec] [Baseline Report] Mode: diff (persisted)
      

      Error in 7.2.x-private:

          [exec] FAILURE: Build failed with an exception.
           [exec] 
           [exec] * What went wrong:
           [exec] Execution failed for task ':apps:user-associated-data:user-associated-data-test-util:baseline'.
           [exec] > Semantic versioning is incorrect while checking /opt/dev/projects/github/liferay-portal-7.2.x-private/tools/sdk/dist/com.liferay.user.associated.data.test.util-5.1.1.jar against /opt/dev/projects/github/liferay-portal-7.2.x-private/.gradle/caches/modules-2/files-2.1/com.liferay/com.liferay.user.associated.data.test.util/5.1.0/d6c9ecc0c09dd15fd6b36b4d6bed465dbb4fbf01/com.liferay.user.associated.data.test.util-5.1.0.jar
           [exec] 
           [exec] * Try:
           [exec] Run with --info or --debug option to get more log output. Run with --scan to get full insights.
           [exec] 
           [exec] * Exception is:
           [exec] org.gradle.api.tasks.TaskExecutionException: Execution failed for task ':apps:user-associated-data:user-associated-data-test-util:baseline'.
           [exec] 	at org.gradle.api.internal.tasks.execution.ExecuteActionsTaskExecuter.executeActions(ExecuteActionsTaskExecuter.java:110)
           [exec] 	at org.gradle.api.internal.tasks.execution.ExecuteActionsTaskExecuter.execute(ExecuteActionsTaskExecuter.java:77)
           [exec] 	at org.gradle.api.internal.tasks.execution.OutputDirectoryCreatingTaskExecuter.execute(OutputDirectoryCreatingTaskExecuter.java:51)
           [exec] 	at org.gradle.api.internal.tasks.execution.SkipUpToDateTaskExecuter.execute(SkipUpToDateTaskExecuter.java:59)
           [exec] 	at org.gradle.api.internal.tasks.execution.ResolveTaskOutputCachingStateExecuter.execute(ResolveTaskOutputCachingStateExecuter.java:54)
           [exec] 	at org.gradle.api.internal.tasks.execution.ValidatingTaskExecuter.execute(ValidatingTaskExecuter.java:59)
           [exec] 	at org.gradle.api.internal.tasks.execution.SkipEmptySourceFilesTaskExecuter.execute(SkipEmptySourceFilesTaskExecuter.java:101)
           [exec] 	at org.gradle.api.internal.tasks.execution.FinalizeInputFilePropertiesTaskExecuter.execute(FinalizeInputFilePropertiesTaskExecuter.java:44)
           [exec] 	at org.gradle.api.internal.tasks.execution.CleanupStaleOutputsExecuter.execute(CleanupStaleOutputsExecuter.java:91)
           [exec] 	at org.gradle.api.internal.tasks.execution.ResolveTaskArtifactStateTaskExecuter.execute(ResolveTaskArtifactStateTaskExecuter.java:62)
           [exec] 	at org.gradle.api.internal.tasks.execution.SkipTaskWithNoActionsExecuter.execute(SkipTaskWithNoActionsExecuter.java:59)
           [exec] 	at org.gradle.api.internal.tasks.execution.SkipOnlyIfTaskExecuter.execute(SkipOnlyIfTaskExecuter.java:54)
           [exec] 	at org.gradle.api.internal.tasks.execution.ExecuteAtMostOnceTaskExecuter.execute(ExecuteAtMostOnceTaskExecuter.java:43)
           [exec] 	at org.gradle.api.internal.tasks.execution.CatchExceptionTaskExecuter.execute(CatchExceptionTaskExecuter.java:34)
           [exec] 	at org.gradle.api.internal.tasks.execution.EventFiringTaskExecuter$1.run(EventFiringTaskExecuter.java:51)
           [exec] 	at org.gradle.internal.operations.DefaultBuildOperationExecutor$RunnableBuildOperationWorker.execute(DefaultBuildOperationExecutor.java:300)
           [exec] 	at org.gradle.internal.operations.DefaultBuildOperationExecutor$RunnableBuildOperationWorker.execute(DefaultBuildOperationExecutor.java:292)
           [exec] 	at org.gradle.internal.operations.DefaultBuildOperationExecutor.execute(DefaultBuildOperationExecutor.java:174)
           [exec] 	at org.gradle.internal.operations.DefaultBuildOperationExecutor.run(DefaultBuildOperationExecutor.java:90)
           [exec] 	at org.gradle.internal.operations.DelegatingBuildOperationExecutor.run(DelegatingBuildOperationExecutor.java:31)
           [exec] 	at org.gradle.api.internal.tasks.execution.EventFiringTaskExecuter.execute(EventFiringTaskExecuter.java:46)
           [exec] 	at org.gradle.execution.taskgraph.LocalTaskInfoExecutor.execute(LocalTaskInfoExecutor.java:42)
           [exec] 	at org.gradle.execution.taskgraph.DefaultTaskExecutionGraph$BuildOperationAwareWorkItemExecutor.execute(DefaultTaskExecutionGraph.java:277)
           [exec] 	at org.gradle.execution.taskgraph.DefaultTaskExecutionGraph$BuildOperationAwareWorkItemExecutor.execute(DefaultTaskExecutionGraph.java:262)
           [exec] 	at org.gradle.execution.taskgraph.DefaultTaskPlanExecutor$ExecutorWorker$1.execute(DefaultTaskPlanExecutor.java:135)
           [exec] 	at org.gradle.execution.taskgraph.DefaultTaskPlanExecutor$ExecutorWorker$1.execute(DefaultTaskPlanExecutor.java:130)
           [exec] 	at org.gradle.execution.taskgraph.DefaultTaskPlanExecutor$ExecutorWorker.execute(DefaultTaskPlanExecutor.java:200)
           [exec] 	at org.gradle.execution.taskgraph.DefaultTaskPlanExecutor$ExecutorWorker.executeWithWork(DefaultTaskPlanExecutor.java:191)
           [exec] 	at org.gradle.execution.taskgraph.DefaultTaskPlanExecutor$ExecutorWorker.run(DefaultTaskPlanExecutor.java:130)
           [exec] 	at org.gradle.internal.concurrent.ExecutorPolicy$CatchAndRecordFailures.onExecute(ExecutorPolicy.java:63)
           [exec] 	at org.gradle.internal.concurrent.ManagedExecutorImpl$1.run(ManagedExecutorImpl.java:46)
           [exec] 	at org.gradle.internal.concurrent.ThreadFactoryImpl$ManagedThreadRunnable.run(ThreadFactoryImpl.java:55)
           [exec] Caused by: org.gradle.api.GradleException: Semantic versioning is incorrect while checking /opt/dev/projects/github/liferay-portal-7.2.x-private/tools/sdk/dist/com.liferay.user.associated.data.test.util-5.1.1.jar against /opt/dev/projects/github/liferay-portal-7.2.x-private/.gradle/caches/modules-2/files-2.1/com.liferay/com.liferay.user.associated.data.test.util/5.1.0/d6c9ecc0c09dd15fd6b36b4d6bed465dbb4fbf01/com.liferay.user.associated.data.test.util-5.1.0.jar
           [exec] 	at com.liferay.gradle.plugins.baseline.BaselineTask.baseline(BaselineTask.java:104)
           [exec] 	at org.gradle.internal.reflect.JavaMethod.invoke(JavaMethod.java:73)
           [exec] 	at org.gradle.api.internal.project.taskfactory.StandardTaskAction.doExecute(StandardTaskAction.java:46)
           [exec] 	at org.gradle.api.internal.project.taskfactory.StandardTaskAction.execute(StandardTaskAction.java:39)
           [exec] 	at org.gradle.api.internal.project.taskfactory.StandardTaskAction.execute(StandardTaskAction.java:26)
           [exec] 	at org.gradle.api.internal.AbstractTask$TaskActionWrapper.execute(AbstractTask.java:801)
           [exec] 	at org.gradle.api.internal.AbstractTask$TaskActionWrapper.execute(AbstractTask.java:768)
           [exec] 	at org.gradle.api.internal.tasks.execution.ExecuteActionsTaskExecuter$1.run(ExecuteActionsTaskExecuter.java:131)
           [exec] 	at org.gradle.internal.operations.DefaultBuildOperationExecutor$RunnableBuildOperationWorker.execute(DefaultBuildOperationExecutor.java:300)
           [exec] 	at org.gradle.internal.operations.DefaultBuildOperationExecutor$RunnableBuildOperationWorker.execute(DefaultBuildOperationExecutor.java:292)
           [exec] 	at org.gradle.internal.operations.DefaultBuildOperationExecutor.execute(DefaultBuildOperationExecutor.java:174)
           [exec] 	at org.gradle.internal.operations.DefaultBuildOperationExecutor.run(DefaultBuildOperationExecutor.java:90)
           [exec] 	at org.gradle.internal.operations.DelegatingBuildOperationExecutor.run(DelegatingBuildOperationExecutor.java:31)
           [exec] 	at org.gradle.api.internal.tasks.execution.ExecuteActionsTaskExecuter.executeAction(ExecuteActionsTaskExecuter.java:120)
           [exec] 	at org.gradle.api.internal.tasks.execution.ExecuteActionsTaskExecuter.executeActions(ExecuteActionsTaskExecuter.java:99)
           [exec] 	... 31 more
           [exec] 
           [exec] 
           [exec] * Get more help at https://help.gradle.org
           [exec] 
           [exec] BUILD FAILED in 2m 14s

      Error in 7.2.x

           [exec] FAILURE: Build failed with an exception.
           [exec] 
           [exec] * What went wrong:
           [exec] Execution failed for task ':apps:user-associated-data:user-associated-data-test-util:baseline'.
           [exec] > Semantic versioning is incorrect while checking /opt/dev/projects/github/liferay-portal-7.2.x/tools/sdk/dist/com.liferay.user.associated.data.test.util-5.1.1.jar against /opt/dev/projects/github/liferay-portal-7.2.x/.gradle/caches/modules-2/files-2.1/com.liferay/com.liferay.user.associated.data.test.util/5.1.0/d6c9ecc0c09dd15fd6b36b4d6bed465dbb4fbf01/com.liferay.user.associated.data.test.util-5.1.0.jar
           [exec] 
           [exec] * Try:
           [exec] Run with --info or --debug option to get more log output. Run with --scan to get full insights.
           [exec] 
           [exec] * Exception is:
           [exec] org.gradle.api.tasks.TaskExecutionException: Execution failed for task ':apps:user-associated-data:user-associated-data-test-util:baseline'.
           [exec] 	at org.gradle.api.internal.tasks.execution.ExecuteActionsTaskExecuter.executeActions(ExecuteActionsTaskExecuter.java:110)
           [exec] 	at org.gradle.api.internal.tasks.execution.ExecuteActionsTaskExecuter.execute(ExecuteActionsTaskExecuter.java:77)
           [exec] 	at org.gradle.api.internal.tasks.execution.OutputDirectoryCreatingTaskExecuter.execute(OutputDirectoryCreatingTaskExecuter.java:51)
           [exec] 	at org.gradle.api.internal.tasks.execution.SkipUpToDateTaskExecuter.execute(SkipUpToDateTaskExecuter.java:59)
           [exec] 	at org.gradle.api.internal.tasks.execution.ResolveTaskOutputCachingStateExecuter.execute(ResolveTaskOutputCachingStateExecuter.java:54)
           [exec] 	at org.gradle.api.internal.tasks.execution.ValidatingTaskExecuter.execute(ValidatingTaskExecuter.java:59)
           [exec] 	at org.gradle.api.internal.tasks.execution.SkipEmptySourceFilesTaskExecuter.execute(SkipEmptySourceFilesTaskExecuter.java:101)
           [exec] 	at org.gradle.api.internal.tasks.execution.FinalizeInputFilePropertiesTaskExecuter.execute(FinalizeInputFilePropertiesTaskExecuter.java:44)
           [exec] 	at org.gradle.api.internal.tasks.execution.CleanupStaleOutputsExecuter.execute(CleanupStaleOutputsExecuter.java:91)
           [exec] 	at org.gradle.api.internal.tasks.execution.ResolveTaskArtifactStateTaskExecuter.execute(ResolveTaskArtifactStateTaskExecuter.java:62)
           [exec] 	at org.gradle.api.internal.tasks.execution.SkipTaskWithNoActionsExecuter.execute(SkipTaskWithNoActionsExecuter.java:59)
           [exec] 	at org.gradle.api.internal.tasks.execution.SkipOnlyIfTaskExecuter.execute(SkipOnlyIfTaskExecuter.java:54)
           [exec] 	at org.gradle.api.internal.tasks.execution.ExecuteAtMostOnceTaskExecuter.execute(ExecuteAtMostOnceTaskExecuter.java:43)
           [exec] 	at org.gradle.api.internal.tasks.execution.CatchExceptionTaskExecuter.execute(CatchExceptionTaskExecuter.java:34)
           [exec] 	at org.gradle.api.internal.tasks.execution.EventFiringTaskExecuter$1.run(EventFiringTaskExecuter.java:51)
           [exec] 	at org.gradle.internal.operations.DefaultBuildOperationExecutor$RunnableBuildOperationWorker.execute(DefaultBuildOperationExecutor.java:300)
           [exec] 	at org.gradle.internal.operations.DefaultBuildOperationExecutor$RunnableBuildOperationWorker.execute(DefaultBuildOperationExecutor.java:292)
           [exec] 	at org.gradle.internal.operations.DefaultBuildOperationExecutor.execute(DefaultBuildOperationExecutor.java:174)
           [exec] 	at org.gradle.internal.operations.DefaultBuildOperationExecutor.run(DefaultBuildOperationExecutor.java:90)
           [exec] 	at org.gradle.internal.operations.DelegatingBuildOperationExecutor.run(DelegatingBuildOperationExecutor.java:31)
           [exec] 	at org.gradle.api.internal.tasks.execution.EventFiringTaskExecuter.execute(EventFiringTaskExecuter.java:46)
           [exec] 	at org.gradle.execution.taskgraph.LocalTaskInfoExecutor.execute(LocalTaskInfoExecutor.java:42)
           [exec] 	at org.gradle.execution.taskgraph.DefaultTaskExecutionGraph$BuildOperationAwareWorkItemExecutor.execute(DefaultTaskExecutionGraph.java:277)
           [exec] 	at org.gradle.execution.taskgraph.DefaultTaskExecutionGraph$BuildOperationAwareWorkItemExecutor.execute(DefaultTaskExecutionGraph.java:262)
           [exec] 	at org.gradle.execution.taskgraph.DefaultTaskPlanExecutor$ExecutorWorker$1.execute(DefaultTaskPlanExecutor.java:135)
           [exec] 	at org.gradle.execution.taskgraph.DefaultTaskPlanExecutor$ExecutorWorker$1.execute(DefaultTaskPlanExecutor.java:130)
           [exec] 	at org.gradle.execution.taskgraph.DefaultTaskPlanExecutor$ExecutorWorker.execute(DefaultTaskPlanExecutor.java:200)
           [exec] 	at org.gradle.execution.taskgraph.DefaultTaskPlanExecutor$ExecutorWorker.executeWithWork(DefaultTaskPlanExecutor.java:191)
           [exec] 	at org.gradle.execution.taskgraph.DefaultTaskPlanExecutor$ExecutorWorker.run(DefaultTaskPlanExecutor.java:130)
           [exec] 	at org.gradle.execution.taskgraph.DefaultTaskPlanExecutor.process(DefaultTaskPlanExecutor.java:74)
           [exec] 	at org.gradle.execution.taskgraph.DefaultTaskExecutionGraph.execute(DefaultTaskExecutionGraph.java:143)
           [exec] 	at org.gradle.execution.SelectedTaskExecutionAction.execute(SelectedTaskExecutionAction.java:40)
           [exec] 	at org.gradle.execution.DefaultBuildExecuter.execute(DefaultBuildExecuter.java:40)
           [exec] 	at org.gradle.execution.DefaultBuildExecuter.access$000(DefaultBuildExecuter.java:24)
           [exec] 	at org.gradle.execution.DefaultBuildExecuter$1.proceed(DefaultBuildExecuter.java:46)
           [exec] 	at org.gradle.execution.DryRunBuildExecutionAction.execute(DryRunBuildExecutionAction.java:49)
           [exec] 	at org.gradle.execution.DefaultBuildExecuter.execute(DefaultBuildExecuter.java:40)
           [exec] 	at org.gradle.execution.DefaultBuildExecuter.execute(DefaultBuildExecuter.java:33)
           [exec] 	at org.gradle.initialization.DefaultGradleLauncher$ExecuteTasks.run(DefaultGradleLauncher.java:355)
           [exec] 	at org.gradle.internal.operations.DefaultBuildOperationExecutor$RunnableBuildOperationWorker.execute(DefaultBuildOperationExecutor.java:300)
           [exec] 	at org.gradle.internal.operations.DefaultBuildOperationExecutor$RunnableBuildOperationWorker.execute(DefaultBuildOperationExecutor.java:292)
           [exec] 	at org.gradle.internal.operations.DefaultBuildOperationExecutor.execute(DefaultBuildOperationExecutor.java:174)
           [exec] 	at org.gradle.internal.operations.DefaultBuildOperationExecutor.run(DefaultBuildOperationExecutor.java:90)
           [exec] 	at org.gradle.internal.operations.DelegatingBuildOperationExecutor.run(DelegatingBuildOperationExecutor.java:31)
           [exec] 	at org.gradle.initialization.DefaultGradleLauncher.runTasks(DefaultGradleLauncher.java:219)
           [exec] 	at org.gradle.initialization.DefaultGradleLauncher.doBuildStages(DefaultGradleLauncher.java:149)
           [exec] 	at org.gradle.initialization.DefaultGradleLauncher.executeTasks(DefaultGradleLauncher.java:124)
           [exec] 	at org.gradle.internal.invocation.GradleBuildController$1.call(GradleBuildController.java:77)
           [exec] 	at org.gradle.internal.invocation.GradleBuildController$1.call(GradleBuildController.java:74)
           [exec] 	at org.gradle.internal.work.DefaultWorkerLeaseService.withLocks(DefaultWorkerLeaseService.java:154)
           [exec] 	at org.gradle.internal.work.StopShieldingWorkerLeaseService.withLocks(StopShieldingWorkerLeaseService.java:38)
           [exec] 	at org.gradle.internal.invocation.GradleBuildController.doBuild(GradleBuildController.java:96)
           [exec] 	at org.gradle.internal.invocation.GradleBuildController.run(GradleBuildController.java:74)
           [exec] 	at org.gradle.tooling.internal.provider.ExecuteBuildActionRunner.run(ExecuteBuildActionRunner.java:28)
           [exec] 	at org.gradle.launcher.exec.ChainingBuildActionRunner.run(ChainingBuildActionRunner.java:35)
           [exec] 	at org.gradle.tooling.internal.provider.ValidatingBuildActionRunner.run(ValidatingBuildActionRunner.java:32)
           [exec] 	at org.gradle.launcher.exec.RunAsBuildOperationBuildActionRunner$3.run(RunAsBuildOperationBuildActionRunner.java:50)
           [exec] 	at org.gradle.internal.operations.DefaultBuildOperationExecutor$RunnableBuildOperationWorker.execute(DefaultBuildOperationExecutor.java:300)
           [exec] 	at org.gradle.internal.operations.DefaultBuildOperationExecutor$RunnableBuildOperationWorker.execute(DefaultBuildOperationExecutor.java:292)
           [exec] 	at org.gradle.internal.operations.DefaultBuildOperationExecutor.execute(DefaultBuildOperationExecutor.java:174)
           [exec] 	at org.gradle.internal.operations.DefaultBuildOperationExecutor.run(DefaultBuildOperationExecutor.java:90)
           [exec] 	at org.gradle.internal.operations.DelegatingBuildOperationExecutor.run(DelegatingBuildOperationExecutor.java:31)
           [exec] 	at org.gradle.launcher.exec.RunAsBuildOperationBuildActionRunner.run(RunAsBuildOperationBuildActionRunner.java:45)
           [exec] 	at org.gradle.tooling.internal.provider.SubscribableBuildActionRunner.run(SubscribableBuildActionRunner.java:51)
           [exec] 	at org.gradle.launcher.exec.InProcessBuildActionExecuter$1.transform(InProcessBuildActionExecuter.java:47)
           [exec] 	at org.gradle.launcher.exec.InProcessBuildActionExecuter$1.transform(InProcessBuildActionExecuter.java:44)
           [exec] 	at org.gradle.composite.internal.DefaultRootBuildState.run(DefaultRootBuildState.java:79)
           [exec] 	at org.gradle.launcher.exec.InProcessBuildActionExecuter.execute(InProcessBuildActionExecuter.java:44)
           [exec] 	at org.gradle.launcher.exec.InProcessBuildActionExecuter.execute(InProcessBuildActionExecuter.java:30)
           [exec] 	at org.gradle.launcher.exec.BuildTreeScopeBuildActionExecuter.execute(BuildTreeScopeBuildActionExecuter.java:39)
           [exec] 	at org.gradle.launcher.exec.BuildTreeScopeBuildActionExecuter.execute(BuildTreeScopeBuildActionExecuter.java:25)
           [exec] 	at org.gradle.tooling.internal.provider.ContinuousBuildActionExecuter.execute(ContinuousBuildActionExecuter.java:80)
           [exec] 	at org.gradle.tooling.internal.provider.ContinuousBuildActionExecuter.execute(ContinuousBuildActionExecuter.java:53)
           [exec] 	at org.gradle.tooling.internal.provider.ServicesSetupBuildActionExecuter.execute(ServicesSetupBuildActionExecuter.java:62)
           [exec] 	at org.gradle.tooling.internal.provider.ServicesSetupBuildActionExecuter.execute(ServicesSetupBuildActionExecuter.java:34)
           [exec] 	at org.gradle.tooling.internal.provider.GradleThreadBuildActionExecuter.execute(GradleThreadBuildActionExecuter.java:36)
           [exec] 	at org.gradle.tooling.internal.provider.GradleThreadBuildActionExecuter.execute(GradleThreadBuildActionExecuter.java:25)
           [exec] 	at org.gradle.tooling.internal.provider.ParallelismConfigurationBuildActionExecuter.execute(ParallelismConfigurationBuildActionExecuter.java:43)
           [exec] 	at org.gradle.tooling.internal.provider.ParallelismConfigurationBuildActionExecuter.execute(ParallelismConfigurationBuildActionExecuter.java:29)
           [exec] 	at org.gradle.tooling.internal.provider.StartParamsValidatingActionExecuter.execute(StartParamsValidatingActionExecuter.java:59)
           [exec] 	at org.gradle.tooling.internal.provider.StartParamsValidatingActionExecuter.execute(StartParamsValidatingActionExecuter.java:31)
           [exec] 	at org.gradle.tooling.internal.provider.SessionFailureReportingActionExecuter.execute(SessionFailureReportingActionExecuter.java:59)
           [exec] 	at org.gradle.tooling.internal.provider.SessionFailureReportingActionExecuter.execute(SessionFailureReportingActionExecuter.java:44)
           [exec] 	at org.gradle.tooling.internal.provider.SetupLoggingActionExecuter.execute(SetupLoggingActionExecuter.java:46)
           [exec] 	at org.gradle.tooling.internal.provider.SetupLoggingActionExecuter.execute(SetupLoggingActionExecuter.java:30)
           [exec] 	at org.gradle.launcher.cli.RunBuildAction.run(RunBuildAction.java:52)
           [exec] 	at org.gradle.internal.Actions$RunnableActionAdapter.execute(Actions.java:207)
           [exec] 	at org.gradle.launcher.cli.CommandLineActionFactory$ParseAndBuildAction.execute(CommandLineActionFactory.java:402)
           [exec] 	at org.gradle.launcher.cli.CommandLineActionFactory$ParseAndBuildAction.execute(CommandLineActionFactory.java:375)
           [exec] 	at org.gradle.launcher.cli.ExceptionReportingAction.execute(ExceptionReportingAction.java:37)
           [exec] 	at org.gradle.launcher.cli.ExceptionReportingAction.execute(ExceptionReportingAction.java:23)
           [exec] 	at org.gradle.launcher.cli.CommandLineActionFactory$WithLogging.execute(CommandLineActionFactory.java:368)
           [exec] 	at org.gradle.launcher.cli.CommandLineActionFactory$WithLogging.execute(CommandLineActionFactory.java:298)
           [exec] 	at org.gradle.launcher.Main.doAction(Main.java:36)
           [exec] 	at org.gradle.launcher.bootstrap.EntryPoint.run(EntryPoint.java:45)
           [exec] 	at org.gradle.launcher.bootstrap.ProcessBootstrap.runNoExit(ProcessBootstrap.java:60)
           [exec] 	at org.gradle.launcher.bootstrap.ProcessBootstrap.run(ProcessBootstrap.java:37)
           [exec] 	at org.gradle.launcher.GradleMain.main(GradleMain.java:23)
           [exec] 	at org.gradle.wrapper.BootstrapMainStarter.start(BootstrapMainStarter.java:31)
           [exec] 	at org.gradle.wrapper.WrapperExecutor.execute(WrapperExecutor.java:108)
           [exec] 	at org.gradle.wrapper.GradleWrapperMain.main(GradleWrapperMain.java:61)
           [exec] Caused by: org.gradle.api.GradleException: Semantic versioning is incorrect while checking /opt/dev/projects/github/liferay-portal-7.2.x/tools/sdk/dist/com.liferay.user.associated.data.test.util-5.1.1.jar against /opt/dev/projects/github/liferay-portal-7.2.x/.gradle/caches/modules-2/files-2.1/com.liferay/com.liferay.user.associated.data.test.util/5.1.0/d6c9ecc0c09dd15fd6b36b4d6bed465dbb4fbf01/com.liferay.user.associated.data.test.util-5.1.0.jar
           [exec] 	at com.liferay.gradle.plugins.baseline.BaselineTask.baseline(BaselineTask.java:104)
           [exec] 	at org.gradle.internal.reflect.JavaMethod.invoke(JavaMethod.java:73)
           [exec] 	at org.gradle.api.internal.project.taskfactory.StandardTaskAction.doExecute(StandardTaskAction.java:46)
           [exec] 	at org.gradle.api.internal.project.taskfactory.StandardTaskAction.execute(StandardTaskAction.java:39)
           [exec] 	at org.gradle.api.internal.project.taskfactory.StandardTaskAction.execute(StandardTaskAction.java:26)
           [exec] 	at org.gradle.api.internal.AbstractTask$TaskActionWrapper.execute(AbstractTask.java:801)
           [exec] 	at org.gradle.api.internal.AbstractTask$TaskActionWrapper.execute(AbstractTask.java:768)
           [exec] 	at org.gradle.api.internal.tasks.execution.ExecuteActionsTaskExecuter$1.run(ExecuteActionsTaskExecuter.java:131)
           [exec] 	at org.gradle.internal.operations.DefaultBuildOperationExecutor$RunnableBuildOperationWorker.execute(DefaultBuildOperationExecutor.java:300)
           [exec] 	at org.gradle.internal.operations.DefaultBuildOperationExecutor$RunnableBuildOperationWorker.execute(DefaultBuildOperationExecutor.java:292)
           [exec] 	at org.gradle.internal.operations.DefaultBuildOperationExecutor.execute(DefaultBuildOperationExecutor.java:174)
           [exec] 	at org.gradle.internal.operations.DefaultBuildOperationExecutor.run(DefaultBuildOperationExecutor.java:90)
           [exec] 	at org.gradle.internal.operations.DelegatingBuildOperationExecutor.run(DelegatingBuildOperationExecutor.java:31)
           [exec] 	at org.gradle.api.internal.tasks.execution.ExecuteActionsTaskExecuter.executeAction(ExecuteActionsTaskExecuter.java:120)
           [exec] 	at org.gradle.api.internal.tasks.execution.ExecuteActionsTaskExecuter.executeActions(ExecuteActionsTaskExecuter.java:99)
           [exec] 	... 100 more
           [exec] 
           [exec] 
           [exec] * Get more help at https://help.gradle.org
           [exec] 
           [exec] BUILD FAILED in 1m 19s

        Attachments

          Activity

            People

            • Votes:
              0 Vote for this issue
              Watchers:
              0 Start watching this issue

              Dates

              • Created:
                Updated:
                Resolved:
                Days since last comment:
                10 weeks, 2 days ago

                Packages

                Version Package
                7.2.X