Uploaded image for project: 'PUBLIC - Liferay Maven'
  1. PUBLIC - Liferay Maven
  2. MAVEN-67

Releasing Maven artifacts for 6.2 M4 fails

    Details

    • Type: Bug
    • Status: Closed
    • Priority: Major
    • Resolution: Fixed
    • Affects Version/s: 6.2.0 GA1
    • Fix Version/s: 6.2.0 GA1
    • Component/s: General
    • Labels:
      None

      Description

      [INFO] ------------------------------------------------------------------------
      [INFO] Building Liferay Maven 2 Plugin
      [INFO]    task-segment: [clean, install]
      [INFO] ------------------------------------------------------------------------
      [INFO] [clean:clean {execution: default-clean}]
      [INFO] Deleting directory P:\liferay-maven-support\plugins\liferay-maven-plugin\target
      [INFO] [plugin:descriptor {execution: default-descriptor}]
      [INFO] Using 'UTF-8' encoding to read mojo metadata.
      [INFO] Applying mojo extractor for language: java
      [INFO] Mojo extractor for language: java found 10 mojo descriptors.
      [INFO] Applying mojo extractor for language: bsh
      [INFO] Mojo extractor for language: bsh found 0 mojo descriptors.
      [debug] execute contextualize
      [INFO] [resources:resources {execution: default-resources}]
      [INFO] Using 'UTF-8' encoding to copy filtered resources.
      [INFO] skip non existing resourceDirectory P:\liferay-maven-support\plugins\liferay-maven-plugin\src\main\resources
      [INFO] [compiler:compile {execution: default-compile}]
      [INFO] Compiling 11 source files to P:\liferay-maven-support\plugins\liferay-maven-plugin\target\classes
      [INFO] -------------------------------------------------------------
      [ERROR] COMPILATION ERROR :
      [INFO] -------------------------------------------------------------
      [ERROR] \liferay-maven-support\plugins\liferay-maven-plugin\src\main\java\com\liferay\maven\plugins\ServiceBuilderMojo.java:[131,2] cannot find symbol
      symbol  : constructor ServiceBuilder(java.lang.String,java.lang.String,java.lang.String,java.lang.String,java.lang.String,java.lang.String,java.lang.String,java.lang.String,java.lang.String,java.lang.String,java.lang.String,java.lang.String,java.lang.String,java.lang.String,java.lang.String,java.lang.String,java.lang.String,java.lang.String,java.lang.String,boolean,java.lang.String,java.lang.String,java.lang.String,java.lang.String,<nulltype>,boolean,long,boolean)
      location: class com.liferay.portal.tools.servicebuilder.ServiceBuilder
      [INFO] 1 error
      [INFO] -------------------------------------------------------------
      [INFO] ------------------------------------------------------------------------
      [ERROR] BUILD FAILURE
      [INFO] ------------------------------------------------------------------------
      [INFO] Compilation failure
      \liferay-maven-support\plugins\liferay-maven-plugin\src\main\java\com\liferay\maven\plugins\ServiceBuilderMojo.java:[131,2] cannot find symbol
      symbol  : constructor ServiceBuilder(java.lang.String,java.lang.String,java.lang.String,java.lang.String,java.lang.String,java.lang.String,java.lang.String,java.lang.String,java.lang.String,java.lang.String,java.lang.String,java.lang.String,java.lang.String,java.lang.String,java.lang.String,java.lang.String,java.lang.String,java.lang.String,java.lang.String,boolean,java.lang.String,java.lang.String,java.lang.String,java.lang.String,<nulltype>,boolean,long,boolean)
      location: class com.liferay.portal.tools.servicebuilder.ServiceBuilder
      
      [INFO] ------------------------------------------------------------------------
      [INFO] For more information, run Maven with the -e switch
      [INFO] ------------------------------------------------------------------------
      [INFO] Total time: 12 seconds
      [INFO] Finished at: Fri Feb 22 11:01:14 PST 2013
      [INFO] Final Memory: 190M/459M
      [INFO] ------------------------------------------------------------------------

        Attachments

          Activity

            People

            • Assignee:
              brian.chan Brian Chan
              Reporter:
              jr.houn JR Houn
              Participants of an Issue:
            • Votes:
              0 Vote for this issue
              Watchers:
              4 Start watching this issue

              Dates

              • Created:
                Updated:
                Resolved:
                Days since last comment:
                7 years, 26 weeks ago

                Packages

                Version Package
                6.2.0 GA1